program: Gaussian 09
title: 000226595
version: EM64L-G09RevD.01
frameworkgroup: C1[X(C9H18O)]
method: RPBEPBE
basis: SDD
operation: Freq
keyword: #pfreq=noraman
keyword: PBEPBE/SDD
title: #p freq=noraman PBEPBE/SDD
converged: YES YES NO NO
title: Mulliken charges:
elementType: O C C C C C C C C C H H H H H H H H H H H H H H H H H H
charge: -0.440565 -0.026622 -0.020720 -0.219797 -0.487724 -0.497335 -0.442261 -0.383597 -0.700642 -0.718063 0.220232 0.201893 0.244549 0.208218 0.216468 0.179917 0.228556 0.199459 0.213810 0.196108 0.191655 0.319653 0.225413 0.210066 0.215206 0.201042 0.253337 0.211742
chargesum: 0.00000
title: Mulliken charges with hydrogens summed into heavy atoms:
elementType: O C C C C C C C C C
charge: -0.120911 0.193610 0.181173 0.024752 -0.063038 -0.088861 -0.028992 0.004166 -0.049956 -0.051942
polarizability: 1.13215649e+02 1.02663582e-01 9.24570195e+01 -5.66393320e-01 1.98444661e+00 8.64840964e+01
1716.lowfreq: -13.2453 0.0007 0.0007 0.0008 11.0822 20.4625 27.3192 87.9102 114.6970
frequency: 26.2361 87.8696 114.6394 133.3468 182.3131 209.1707 220.4111 244.9526 272.4778 290.1432 326.4519 349.4937 393.1040 472.0145 536.9240 561.5825 619.5937 757.1836 773.1140 803.2155 856.3522 861.1415 900.8766 934.3925 953.2840 972.1082 975.6169 1021.8787 1028.7527 1042.3760 1071.2629 1080.6920 1109.5475 1131.2922 1146.4866 1162.9323 1186.0914 1211.6663 1238.5210 1250.2756 1258.0502 1272.4944 1284.3353 1294.9189 1306.7646 1322.2025 1329.6972 1340.2918 1348.3541 1374.5004 1387.4106 1394.2990 1459.9420 1464.2920 1470.2025 1476.2182 1477.5252 1479.8090 1485.9013 1491.0072 2943.2430 2960.0223 2961.9566 2973.4097 2974.5812 2975.1265 2976.6004 2979.8903 3018.0732 3024.3716 3047.7745 3058.8422 3061.7809 3067.2860 3069.1200 3073.2173 3085.1368 3544.9874
redmass: 3.4118 2.2114 2.1004 2.5051 2.1112 1.8835 1.3422 1.5265 1.8956 1.1094 2.5528 2.8294 3.1096 2.6205 2.5486 2.3774 2.6192 1.4746 1.3908 1.8782 1.7328 1.9464 2.4088 1.7629 1.6250 2.2796 1.9173 1.3190 2.2799 2.2573 1.9855 1.7544 1.6801 2.0224 2.1965 1.8678 1.5174 1.4932 1.3199 1.2647 1.3394 1.2472 1.3521 1.2555 1.3390 1.3388 1.4600 1.5027 1.6416 1.1595 1.2106 1.2133 1.0800 1.0733 1.0768 1.0832 1.0464 1.0589 1.0583 1.0510 1.0806 1.0631 1.0676 1.0529 1.0417 1.0736 1.0449 1.0650 1.1002 1.0995 1.0944 1.0995 1.0910 1.0988 1.0998 1.0994 1.0999 1.0659
irintensity: 0.8130 0.1179 0.3032 0.3721 1.1038 2.4063 0.4593 0.7577 1.5359 99.6725 41.7465 0.3649 0.4722 4.1599 2.6173 1.8825 3.6001 9.6292 7.3321 24.1302 4.5705 14.2516 25.3547 8.1676 2.1113 24.0816 0.3700 0.1845 4.4416 3.1764 0.6478 6.7241 38.4507 2.9097 7.0689 13.8798 1.9250 8.3618 0.4958 1.0361 1.9081 0.3344 0.1855 1.0836 1.6067 1.3338 0.4586 0.9785 2.4305 24.3410 15.0784 15.2087 1.5634 4.7419 14.4683 13.4512 6.9638 3.8430 9.0244 11.4672 5.6391 26.0447 33.0834 59.5153 50.9333 11.5256 20.4085 44.5537 22.6658 18.9831 44.4814 27.8791 31.5452 55.8725 81.7768 58.5393 43.6849 3.6977
temp: 298.150 k
press: 1.00000 atm
elementType: 8 6 6 6 6 6 6 6 6 6 1 1 1 1 1 1 1 1 1 1 1 1 1 1 1 1 1 1
symmnumber: 1
zpe: 664067.5 jmol-1
zpe.correction: 0.252930 hartree
zpe.thermalcorrener: 0.264750 hartree
zpe.thermalcorrenthalpy: 0.265695 hartree
zpe.thermalcorrgfe: 0.215210 hartree
zpe.sumelectzpe: -428.137627 hartree
zpe.sumelectthermal: -428.125807 hartree
zpe.sumelectthermalent: -428.124862 hartree
zpe.sumelectthermalfe: -428.175347 hartree
dipole: 0.7112 1.7973 -0.4142
dipole: 1.9768
quadrupole: -65.0314 -67.6615 -61.9513
quadrupole: -2.3428 0.3917 3.2896
quadrupole: -0.1500 -2.7801 2.9301 -2.3428 0.3917 3.2896
hfenergy: -428.390557 hartree
pointgroup: C01 [X(C9H18O1)]
dipole: 0.2745939 -0.7158902 0.1303174 debye
polarizability: 113.2111329|-0.2800037|92.262827|0.6136691|2.2486403|86.6828048 unknown
InChI: InChI=1S/C9H18O/c1-3-7-5-6-8(4-2)9(7)10/h7-10H,3-6H2,1-2H3
charge 0 multiplicity 1
28 atoms
O  -0.747601 1.290105 -1.408531
C  1.230571 0.132279 -0.342819
C  -1.079775 -0.52222 0.330286
C  -0.225202 0.68837 -0.158833
C  1.112473 -1.421736 -0.194516
C  -0.396303 -1.731069 -0.36207
C  2.251068 0.774006 0.628828
C  -2.601337 -0.399292 0.109344
C  3.701777 0.298657 0.39645
C  -3.237129 0.785151 0.869272
H  1.548796 0.387264 -1.374941
H  -0.892547 -0.619541 1.422855
H  -0.258006 1.53685 0.544238
H  1.435323 -1.722965 0.822453
H  1.748114 -1.967712 -0.913926
H  -0.67562 -1.764316 -1.437077
H  -0.691142 -2.70096 0.077266
H  1.948738 0.546883 1.672599
H  2.207021 1.876337 0.519547
H  -3.081328 -1.348453 0.423506
H  -2.806282 -0.284578 -0.973465
H  -0.770143 0.588878 -2.108956
H  3.794123 -0.795758 0.523595
H  4.037512 0.547154 -0.628374
H  4.399702 0.779608 1.106202
H  -3.032554 0.719527 1.955189
H  -2.834433 1.743909 0.498058
H  -4.334217 0.803821 0.733923
