program: Gaussian 09
title: 000226585
version: EM64L-G09RevD.01
frameworkgroup: C1[X(C15H15ClN4O2)]
method: RPBEPBE
basis: SDD
operation: Freq
keyword: #p
keyword: freq=noraman
keyword: PBEPBE/SDD
title: #p freq=noraman PBEPBE/SDD
converged: YES YES NO NO
title: Mulliken charges:
elementType: Cl O O N N N N C C C C C C C C C C C C C C C H H H H H H H H H H H H H H H
charge: -0.074115 -0.274597 -0.292494 -0.447480 -0.448483 -0.028618 -0.623479 -0.205477 -0.435262 -0.608069 -0.550900 0.038822 0.333010 0.130777 -0.009915 0.135828 0.470198 -0.439762 -0.339433 -0.195047 -0.205571 -0.113473 0.254096 0.219535 0.265543 0.240006 0.265401 0.260789 0.235641 0.314006 0.357249 0.315880 0.358235 0.281085 0.309779 0.255313 0.250985
chargesum: 0.00000
title: Mulliken charges with hydrogens summed into heavy atoms:
elementType: Cl O O N N N N C C C C C C C C C C C C C C C
charge: -0.074115 -0.274597 -0.292494 -0.133474 -0.091234 -0.028618 0.050636 0.048619 0.049816 -0.102662 -0.054470 0.038822 0.333010 0.130777 -0.009915 0.135828 0.470198 -0.158677 -0.029654 0.060266 0.045414 -0.113473
polarizability: 2.48481946e+02 2.75286227e+01 2.05372196e+02 8.31974676e+00 9.18422588e+00 1.64042908e+02
1716.lowfreq: -6.4005 -1.4206 -0.0011 -0.0010 0.0003 7.6740 22.8956 41.5370 52.0270
frequency: 22.4716 41.4295 52.0070 65.7213 75.5717 94.5416 101.8442 167.0440 170.1614 183.2476 197.0924 237.2958 262.4941 280.9886 294.4315 304.5623 341.2658 351.7812 366.4421 391.8764 404.3642 414.0593 456.5252 469.8714 502.6433 517.9249 527.0824 536.4427 554.0156 566.9943 592.1874 609.6713 625.3584 646.5649 661.5377 697.2524 707.1312 735.9612 755.1552 778.4582 793.8032 829.5648 835.5776 843.3126 845.8348 869.9008 892.0510 945.5393 951.3030 961.0044 977.5803 979.1555 994.1790 1006.0537 1050.7444 1071.4259 1097.5526 1115.1750 1130.8528 1154.4354 1172.0524 1176.5422 1188.5503 1192.7327 1212.7586 1229.6672 1269.6708 1275.3469 1279.7499 1298.9135 1323.9487 1334.2485 1344.1535 1350.8556 1370.0474 1400.9783 1401.1327 1442.1632 1451.8223 1464.1081 1480.6069 1490.0144 1525.5404 1540.7619 1586.1072 1589.1462 1604.7929 1613.2415 1633.6035 1660.0571 2962.4541 2985.7889 2994.9481 3004.4188 3019.3934 3048.8721 3081.3284 3128.1846 3163.4913 3172.0958 3196.5121 3391.9184 3531.9545 3552.8570 3703.7011
redmass: 7.9828 4.8826 5.4420 7.9546 9.2714 6.0364 5.0581 4.7003 3.0455 8.0594 7.7153 4.5523 2.9576 1.3027 3.2202 6.6945 5.2989 4.4702 4.9600 3.0749 5.1059 3.0899 5.5479 4.5603 3.2434 3.4748 1.2141 4.2194 4.7489 1.7018 2.2677 5.3656 6.9349 5.6848 5.0448 8.8461 3.7734 5.8313 6.0044 1.3564 2.2649 2.7275 1.2471 3.0035 1.7244 3.1285 3.6604 2.7804 2.5019 1.3405 1.3502 2.5368 4.4122 2.0451 2.0154 2.5511 1.9715 1.3532 1.7531 1.9734 2.0382 2.1833 1.1274 1.2170 3.2180 1.8772 1.8464 1.8206 1.6790 1.4066 1.6757 1.6299 1.5884 1.4425 4.6456 4.1227 4.3332 3.4245 1.2141 1.1305 2.4039 1.2818 2.6819 4.0085 8.9041 1.6076 5.9585 2.4950 2.2344 6.3739 1.0599 1.0712 1.0731 1.0869 1.0794 1.0971 1.1007 1.0918 1.0911 1.0951 1.0951 1.0797 1.0774 1.0459 1.1051
irintensity: 1.3757 2.3063 8.9785 13.2859 4.6202 8.0222 2.1785 2.2859 0.4664 3.5440 3.3648 1.8812 9.1407 65.4011 7.6939 9.3964 1.8663 11.9146 0.9709 1.0305 19.1534 0.5059 4.7017 5.1355 33.4624 3.7934 277.1115 6.5973 2.9027 18.7386 29.0405 1.3029 0.5931 7.9866 8.6533 10.9983 5.0825 2.2981 20.2337 42.1324 40.6623 4.1244 6.9690 14.9946 128.5482 9.5088 8.3783 2.1583 3.9578 12.4507 2.0658 9.7783 30.6137 15.3560 20.1157 33.2824 8.9282 14.5478 5.7045 2.6687 15.1039 18.6896 2.6392 0.9129 7.9747 1.1686 41.4661 31.2448 13.7354 26.1293 6.1157 1.4889 49.1688 2.5021 70.3137 13.5159 24.2355 109.6541 19.7737 61.1344 200.2404 158.9686 156.7122 559.5409 113.3290 48.3052 13.8638 46.1486 389.3764 250.6431 24.7967 13.6882 14.3566 24.1052 73.0366 11.9191 11.4587 0.6416 3.3939 1.9954 6.0174 207.1736 24.4971 111.8302 43.8451
temp: 298.150 k
press: 1.00000 atm
elementType: 17 8 8 7 7 7 7 6 6 6 6 6 6 6 6 6 6 6 6 6 6 6 1 1 1 1 1 1 1 1 1 1 1 1 1 1 1
symmnumber: 1
zpe: 747353.5 jmol-1
zpe.correction: 0.284652 hartree
zpe.thermalcorrener: 0.303862 hartree
zpe.thermalcorrenthalpy: 0.304806 hartree
zpe.thermalcorrgfe: 0.236070 hartree
zpe.sumelectzpe: -1408.577205 hartree
zpe.sumelectthermal: -1408.557994 hartree
zpe.sumelectthermalent: -1408.557050 hartree
zpe.sumelectthermalfe: -1408.625787 hartree
dipole: -8.7729 0.7635 -4.8022
dipole: 10.0303
quadrupole: -125.1524 -130.5105 -130.7380
quadrupole: -5.7996 19.5196 -17.7283
quadrupole: 3.6479 -1.7102 -1.9377 -5.7996 19.5196 -17.7283
hfenergy: -1408.8618565 hartree
pointgroup: C01 [X(C15H15Cl1N4O2)]
dipole: 3.4993611 -0.624336 -1.713874 debye
polarizability: 228.8662175|24.7433637|185.7579189|-25.6280777|-30.904582|203.2729138 unknown
InChI: InChI=1S/C15H15ClN4O2/c16-9-2-4-10(5-3-9)18-13(21)8-1-6-12-11(7-8)14(22)20-15(17)19-12/h2-5,8,18-19H,1,6-7,17H2
charge 0 multiplicity 1
37 atoms
Cl -5.758948 -2.66054 1.374488
O  -1.320752 1.144424 -2.50451
O  0.888298 0.852084 2.311156
N  2.972101 -0.919626 -0.635096
N  -1.16477 0.981589 -0.167168
N  2.512101 -0.742143 1.71107
N  3.846707 -2.493445 0.912486
C  0.472433 2.401513 -1.412642
C  1.443491 2.047502 -2.573484
C  1.277445 2.430834 -0.094292
C  2.187276 0.696142 -2.366264
C  1.903922 1.073449 0.148035
C  2.38629 0.331293 -0.908235
C  -0.747352 1.443865 -1.408549
C  1.745825 0.413489 1.466792
C  3.097099 -1.356358 0.687546
C  -2.258343 0.117025 0.127997
C  -2.374575 -0.330668 1.473714
C  -3.214236 -0.296374 -0.838635
C  -3.436787 -1.173086 1.856239
C  -4.277776 -1.14181 -0.453087
C  -4.3776 -1.566448 0.884286
H  0.060539 3.409537 -1.621875
H  2.179885 2.868508 -2.657052
H  0.877306 2.002615 -3.518879
H  2.062543 3.20668 -0.182312
H  0.672004 2.715586 0.784436
H  1.59074 -0.116813 -2.830755
H  3.156795 0.719975 -2.903116
H  3.258061 -1.515159 -1.414787
H  -0.59248 1.220199 0.655852
H  4.431753 -2.92901 0.204822
H  3.874384 -2.833576 1.87114
H  -1.624026 -0.029546 2.215065
H  -3.113308 0.038905 -1.871954
H  -3.525314 -1.51817 2.890069
H  -5.01843 -1.461743 -1.191799
