program: Gaussian 09
title: 000226572
version: EM64L-G09RevD.01
frameworkgroup: C1[X(C12H13N3O2)]
method: RPBEPBE
basis: SDD
operation: Freq
keyword: #p
keyword: freq=noraman
keyword: PBEPBE/SDD
title: #p freq=noraman PBEPBE/SDD
converged: YES YES NO NO
title: Mulliken charges:
elementType: O O N N N C C C C C C C C C C C C H H H H H H H H H H H H H
charge: -0.263857 -0.335304 -0.261741 -0.058382 -0.650063 0.379233 0.115945 0.164905 0.283912 -0.332718 -0.353793 -0.404710 0.328428 -0.362863 -0.343814 -0.770115 -0.537386 0.319078 0.290561 0.238257 0.239223 0.248467 0.249256 0.229996 0.230421 0.313423 0.356455 0.221806 0.243570 0.221811
chargesum: 0.00000
title: Mulliken charges with hydrogens summed into heavy atoms:
elementType: O O N N N C C C C C C C C C C C C
charge: -0.263857 -0.335304 -0.261741 -0.058382 0.019814 0.379233 0.115945 0.164905 0.283912 -0.013640 -0.063232 -0.166453 0.328428 -0.123640 -0.095348 -0.060442 0.149801
polarizability: 2.79724889e+02 -3.77463568e+00 1.80481670e+02 -2.37508677e-02 -2.49134519e-01 7.23881664e+01
1716.lowfreq: -5.6688 -0.0008 -0.0002 0.0003 3.7507 7.3847 21.5730 46.4257 89.0363
frequency: 21.3913 46.4157 89.0331 113.2421 118.9817 129.9603 177.7126 190.6954 209.6373 235.8931 257.3654 307.3397 335.2393 345.1865 383.5639 387.2867 418.3258 454.4749 460.7178 475.4425 491.7129 524.3949 556.6586 577.4965 604.4879 613.2021 639.4282 642.1174 730.1274 745.5679 755.8451 775.9140 822.4816 843.7166 845.7935 846.5709 976.6606 984.2902 985.5824 987.3540 988.3816 1002.4784 1046.3247 1058.1137 1107.2523 1112.8095 1126.7013 1142.9537 1156.1949 1187.1630 1200.0509 1228.4594 1280.6455 1300.3856 1375.8898 1384.5447 1398.0302 1423.0901 1431.3087 1435.7258 1454.8467 1466.0002 1467.5752 1472.7196 1490.4528 1508.5125 1552.0299 1580.9891 1586.8604 1620.4306 1645.2832 2959.0542 2984.4865 3046.7559 3063.8081 3115.5225 3123.8616 3144.3669 3159.2632 3160.9792 3201.8401 3205.3623 3493.0570 3681.4025
redmass: 3.6926 4.8709 4.4958 1.4433 4.4115 2.2016 3.0510 4.0657 3.5041 1.2337 4.5166 3.5881 5.1184 3.9241 6.1386 2.5720 3.1299 1.5691 4.9900 5.0490 3.3358 5.9967 2.9000 5.6136 4.7936 5.5794 1.0903 6.6396 4.0507 7.1811 5.7005 6.7065 1.2621 1.4470 1.6109 6.6470 1.3239 2.4947 3.0396 1.3800 4.8483 2.5039 1.4950 1.4669 2.0065 1.2607 2.0057 3.5652 1.3422 1.3384 1.7927 3.2036 5.9492 1.3606 4.4662 2.6300 1.6045 3.9045 3.3805 1.2113 1.2538 1.0500 1.0457 1.1057 2.4116 3.3119 6.0214 4.5228 1.7600 6.4192 5.0965 1.0328 1.0376 1.1039 1.0981 1.0983 1.0995 1.0932 1.0900 1.0906 1.0938 1.0938 1.0488 1.0996
irintensity: 1.0754 5.9376 0.0498 0.3369 2.5245 5.7160 6.7447 0.6223 1.3970 1.6769 2.9419 11.4735 0.0153 1.1033 16.0642 30.5570 0.4705 118.9570 2.7360 2.8083 22.1541 12.5618 31.1853 26.7611 0.5449 0.2760 116.3647 0.8227 0.9512 0.9141 3.8404 17.9790 10.3660 11.4320 109.3756 1.0459 6.4608 9.4197 70.7715 1.6287 11.6944 30.1844 6.8461 0.1000 22.8115 0.2237 18.7769 6.9415 7.6494 143.1685 7.3595 140.4893 20.2770 6.5547 16.6967 7.3051 27.4776 3.4145 11.9397 20.6323 19.8503 12.9854 15.8110 97.2276 178.0939 169.9789 279.8049 0.1272 43.5350 62.7990 264.6098 79.9103 30.5338 49.6262 19.7337 8.6665 28.6084 19.9016 12.8162 6.6811 10.5536 7.1860 95.4466 65.0204
temp: 298.150 k
press: 1.00000 atm
elementType: 8 8 7 7 7 6 6 6 6 6 6 6 6 6 6 6 6 1 1 1 1 1 1 1 1 1 1 1 1 1
symmnumber: 1
zpe: 614158.4 jmol-1
zpe.correction: 0.233921 hartree
zpe.thermalcorrener: 0.249486 hartree
zpe.thermalcorrenthalpy: 0.250430 hartree
zpe.thermalcorrgfe: 0.190556 hartree
zpe.sumelectzpe: -778.538454 hartree
zpe.sumelectthermal: -778.522888 hartree
zpe.sumelectthermalent: -778.521944 hartree
zpe.sumelectthermalfe: -778.581818 hartree
dipole: 2.8024 -0.8754 0.0465
dipole: 2.9363
quadrupole: -61.4756 -94.2105 -104.1986
quadrupole: 4.8388 -0.1928 -0.1422
quadrupole: 25.1526 -7.5822 -17.5704 4.8388 -0.1928 -0.1422
hfenergy: -778.7723745 hartree
pointgroup: C01 [X(C12H13N3O2)]
dipole: 1.1098279 0.320642 0.0061419 debye
polarizability: 279.8422702|1.5831062|179.8227012|0.3165473|7.6306088|72.9297541 unknown
InChI: InChI=1S/C12H13N3O2/c1-8-7-11(13)12(16)15(14-8)9-3-5-10(17-2)6-4-9/h3-7H,13H2,1-2H3
charge 0 multiplicity 1
30 atoms
O  -4.74301 -0.439545 0.060683
O  1.19593 2.338226 0.275397
N  0.941189 -0.034699 0.088729
N  1.514223 -1.317721 -0.011326
N  3.840071 2.180419 0.260757
C  -0.516113 -0.067825 0.087455
C  1.691004 1.157054 0.181923
C  2.852686 -1.408314 -0.020352
C  3.16489 0.989613 0.167344
C  -1.306842 1.107686 0.152215
C  -1.166335 -1.33258 0.015613
C  3.728705 -0.28126 0.06628
C  -3.354093 -0.239106 0.073726
C  -2.71671 1.020947 0.144863
C  -2.565453 -1.415379 0.009347
C  3.405603 -2.813887 -0.13189
C  -5.593971 0.750927 0.121914
H  -0.821541 2.081563 0.209803
H  -0.557351 -2.235119 -0.035675
H  4.812881 -0.431155 0.052774
H  -3.295343 1.948077 0.195665
H  -3.069789 -2.384806 -0.045635
H  2.578622 -3.539215 -0.180289
H  4.042081 -3.059221 0.738386
H  4.026225 -2.924288 -1.040508
H  4.854107 2.231689 0.265218
H  3.263252 3.022908 0.328906
H  -5.425867 1.317986 1.058252
H  -6.625383 0.369505 0.098942
H  -5.421069 1.414021 -0.74812
