program: Gaussian 09
title: 000226571
version: EM64L-G09RevD.01
frameworkgroup: C1[X(C12H11ClN2O2)]
method: RPBEPBE
basis: SDD
operation: Freq
keyword: #p
keyword: freq=noraman
keyword: PBEPBE/SDD
title: #p freq=noraman PBEPBE/SDD
converged: YES YES NO NO
title: Mulliken charges:
elementType: Cl O O N N C C C C C C C C C C C C H H H H H H H H H H H
charge: 0.018317 -0.260051 -0.259438 -0.279653 -0.030519 0.377736 -0.322758 -0.341384 0.305610 0.141403 0.330872 -0.361619 -0.339499 -0.247028 -0.221210 -0.762550 -0.537145 0.319371 0.286523 0.243420 0.251797 0.267169 0.236940 0.251723 0.236459 0.224673 0.246286 0.224554
chargesum: 0.00000
title: Mulliken charges with hydrogens summed into heavy atoms:
elementType: Cl O O N N C C C C C C C C C C C C
charge: 0.018317 -0.260051 -0.259438 -0.279653 -0.030519 0.377736 -0.003387 -0.054861 0.305610 0.141403 0.330872 -0.118199 -0.087702 -0.247028 0.045959 -0.037428 0.158367
polarizability: 3.08042634e+02 4.78975750e+00 1.80887138e+02 3.42157706e-02 1.31875481e-01 7.09390019e+01
1716.lowfreq: -5.2691 -4.6224 -3.7191 0.0017 0.0026 0.0026 15.1655 38.1433 79.1723
frequency: 12.0769 38.1374 79.1701 108.4600 109.8172 127.2991 158.1534 189.0616 198.7357 211.4703 240.0443 279.2939 324.1517 331.1170 352.3729 357.0494 402.9685 415.5115 463.5097 479.8729 480.3628 552.3238 568.7066 594.8484 601.0239 640.1990 723.5469 730.9651 733.2322 779.3625 794.2830 820.7462 845.4251 880.2976 891.7014 977.8562 983.3764 986.5761 987.1991 1001.8270 1027.1153 1045.6773 1107.8297 1111.8623 1114.1220 1132.2883 1158.5220 1185.2378 1225.2976 1245.8476 1258.5347 1303.8120 1375.5166 1382.2261 1398.0142 1429.0910 1437.7174 1450.3141 1465.4924 1468.2940 1473.0366 1488.2612 1503.3248 1564.7311 1578.5244 1606.2553 1623.9674 2964.3749 2987.4220 3053.9995 3066.4557 3118.8757 3128.6179 3160.0119 3163.6433 3167.4556 3204.7839 3210.6535
redmass: 3.8864 7.5704 4.8548 4.9475 1.2572 2.8341 4.3134 3.4730 5.7549 3.8007 1.2397 6.1922 5.4296 5.2342 7.6163 5.7574 6.6749 3.1206 4.6914 5.4455 4.2890 3.0523 5.6917 4.9038 6.2200 7.0248 5.6967 7.1303 5.6780 7.4371 7.0501 1.2614 1.6400 1.3494 7.9186 1.3191 4.2303 1.3214 2.5682 2.3251 4.2386 1.4845 2.6719 2.0031 1.2593 1.9680 1.3295 1.3405 3.5111 3.1507 2.9580 1.2994 4.5583 5.0142 1.2901 4.0807 1.1785 1.3274 1.0451 1.0494 1.1099 2.2215 3.2629 7.7988 8.1004 7.8471 7.0830 1.0327 1.0379 1.1041 1.0981 1.0983 1.0999 1.0905 1.0906 1.0944 1.0935 1.0942
irintensity: 1.5732 3.5317 0.0376 2.3588 0.1351 6.0611 0.1842 4.3498 0.7123 1.1897 1.3237 2.0711 3.3258 0.4221 5.3033 0.1636 1.6583 0.3332 2.2675 4.4742 1.2155 26.3674 51.3285 0.0656 1.3017 1.2360 4.9787 7.9330 1.0540 1.7275 40.5172 7.4275 84.9611 17.5531 65.9517 4.9946 100.3893 0.3564 2.0940 16.4790 17.4060 5.9304 77.3281 33.8457 0.1755 57.5939 4.0533 154.3379 99.4166 95.6382 21.5516 5.6338 8.9812 6.2977 16.2055 14.1575 24.0156 7.8820 16.3512 14.1227 93.0776 133.9219 20.9089 204.5884 23.0072 92.3141 83.3436 80.7401 22.7332 45.7684 15.6269 6.0614 26.5742 12.6612 5.5639 0.4269 1.5338 15.1698
temp: 298.150 k
press: 1.00000 atm
elementType: 17 8 8 7 7 6 6 6 6 6 6 6 6 6 6 6 6 1 1 1 1 1 1 1 1 1 1 1
symmnumber: 1
zpe: 543339.9 jmol-1
zpe.correction: 0.206947 hartree
zpe.thermalcorrener: 0.222602 hartree
zpe.thermalcorrenthalpy: 0.223547 hartree
zpe.thermalcorrgfe: 0.162097 hartree
zpe.sumelectzpe: -1182.632916 hartree
zpe.sumelectthermal: -1182.617261 hartree
zpe.sumelectthermalent: -1182.616317 hartree
zpe.sumelectthermalfe: -1182.677766 hartree
dipole: -0.3467 2.6394 0.0034
dipole: 2.6621
quadrupole: -81.8971 -103.3558 -108.3610
quadrupole: 21.4953 0.0204 0.0518
quadrupole: 15.9742 -5.4845 -10.4897 21.4953 0.0204 0.0518
hfenergy: -1182.8398634 hartree
pointgroup: C01 [X(C12H11Cl1N2O2)]
dipole: -0.0748339 1.038653 0.1119777 debye
polarizability: 308.1013004|-2.313413|179.5248492|-4.1245886|11.6055154|72.2426241 unknown
InChI: InChI=1S/C12H11ClN2O2/c1-8-7-11(13)12(16)15(14-8)9-3-5-10(17-2)6-4-9/h3-7H,1-2H3
charge 0 multiplicity 1
28 atoms
Cl 4.187485 -2.378116 -0.441532
O  -4.759218 0.405283 -0.001385
O  1.176252 -2.312319 -0.392635
N  0.925842 0.0563 -0.139912
N  1.485705 1.322907 -0.017035
C  -0.53281 0.071526 -0.112826
C  -1.316543 -1.105897 -0.229224
C  -1.193894 1.325576 0.037488
C  1.697309 -1.164502 -0.279358
C  2.817034 1.456697 -0.02216
C  -3.372882 0.217252 -0.046764
C  -2.7261 -1.031125 -0.195664
C  -2.591801 1.396055 0.069621
C  3.146423 -0.921785 -0.274291
C  3.704213 0.331294 -0.151569
C  3.355429 2.863073 0.116533
C  -5.606761 -0.785837 -0.115832
H  -0.830355 -2.073277 -0.345006
H  -0.596268 2.232645 0.127341
H  -3.296963 -1.959687 -0.287337
H  -3.102834 2.356468 0.185173
H  4.787429 0.480041 -0.15136
H  3.983581 2.960173 1.021302
H  2.521913 3.578473 0.190213
H  3.980481 3.137181 -0.753195
H  -5.418501 -1.49248 0.71535
H  -6.638645 -0.410192 -0.058446
H  -5.448123 -1.299027 -1.08389
