program: Gaussian 09
title: 000226564
version: EM64L-G09RevD.01
frameworkgroup: C1[X(C17H17NO4)]
method: RPBEPBE
basis: SDD
operation: Freq
keyword: #p
keyword: freq=noraman
keyword: PBEPBE/SDD
title: #p freq=noraman PBEPBE/SDD
converged: YES YES NO NO
title: Mulliken charges:
elementType: O O O O N C C C C C C C C C C C C C C C C C H H H H H H H H H H H H H H H H H
charge: -0.306970 -0.441943 -0.218132 -0.277700 -0.470310 0.106657 0.438702 -0.718069 0.156041 -0.371937 -0.348801 0.274312 -0.236165 -0.246207 -0.239534 -0.416214 0.475337 -0.372118 -0.402300 -0.224749 -0.224448 -0.232482 0.222510 0.282604 0.236241 0.371817 0.246359 0.242917 0.226885 0.226693 0.230147 0.231514 0.230589 0.393582 0.235844 0.233342 0.227717 0.228012 0.230253
chargesum: 0.00000
title: Mulliken charges with hydrogens summed into heavy atoms:
elementType: O O O O N C C C C C C C C C C C C C C C C C
charge: -0.306970 -0.048360 -0.218132 -0.277700 -0.098493 0.106657 0.438702 0.023286 0.156041 -0.125578 -0.105884 0.274312 -0.009280 -0.019514 -0.009387 0.045889 0.475337 -0.136274 -0.168958 0.002968 0.003565 -0.002229
polarizability: 2.56224093e+02 -1.03200076e+01 1.99042022e+02 -2.86545984e+01 -1.54875862e+01 1.39709991e+02
1716.lowfreq: -17.8271 -13.0292 -2.9565 -0.0005 -0.0003 0.0001 3.7560 9.9983 16.4489
frequency: -17.2371 -9.9663 16.2073 42.4168 43.7454 55.3247 74.7552 97.0347 115.3274 126.4737 185.1685 205.7181 212.3511 227.4687 246.0350 283.9219 310.6741 320.1347 343.2765 352.0401 389.0733 402.0485 403.0855 469.5293 491.8220 500.4754 555.7735 567.3412 605.4277 611.1488 616.4044 617.0824 635.0512 684.3349 699.4462 701.0550 704.1695 707.9172 728.7003 762.8427 771.0353 822.2888 842.2348 850.9218 853.3819 893.8721 918.2526 929.9263 933.1704 953.9263 976.6812 978.4742 990.5808 991.0012 996.6346 996.7237 998.8421 1023.9916 1025.9940 1026.9652 1078.7090 1085.4109 1088.3491 1126.5056 1163.4442 1172.9305 1175.1208 1186.9765 1192.4116 1193.7237 1196.2598 1223.0774 1227.9679 1291.6857 1319.3103 1324.6322 1352.4021 1380.6945 1385.8071 1388.6530 1434.4976 1440.1310 1460.8372 1472.9624 1477.2477 1481.2840 1486.7472 1489.4590 1592.9028 1596.3094 1608.0327 1617.3671 1666.9415 1667.7828 3010.7794 3011.9580 3073.3827 3111.5913 3121.8907 3124.4803 3126.2752 3136.0999 3136.5121 3141.9651 3148.8308 3150.7726 3159.4734 3165.0008 3169.2340 3531.4982 3541.9107
redmass: 4.1985 4.0688 4.1473 5.4298 5.2911 8.4356 9.8736 5.9422 5.7549 5.7842 4.5278 3.3099 4.3871 1.4115 3.7472 4.3933 3.9171 2.3918 4.5846 4.5927 6.7860 2.7969 2.8222 4.1927 3.4567 3.2958 4.6025 3.1216 2.4150 2.1387 6.0686 5.7628 1.1793 6.0625 2.4248 2.2279 7.4330 2.7311 2.7131 2.0756 2.3625 3.6714 3.1871 1.2661 1.2475 3.3401 2.1375 1.6468 2.1230 1.6486 1.3928 1.4066 5.7806 6.1200 1.4040 1.4093 3.3151 2.6391 2.3732 2.3869 1.8764 1.7107 1.5138 2.0929 2.8035 1.0540 1.0979 1.1478 1.2968 1.8211 1.2443 3.2112 2.3587 2.4121 1.3433 1.2766 1.3918 6.5425 8.5878 1.2373 2.2189 2.1883 1.0975 1.3886 1.3474 1.5474 2.0405 1.3584 6.1308 6.1494 6.0593 6.2014 9.4811 9.5245 1.0576 1.0368 1.1076 1.0978 1.0852 1.0881 1.0847 1.0887 1.0920 1.1013 1.0964 1.0927 1.0950 1.1017 1.1005 1.0646 1.0769
irintensity: 0.0472 0.0382 0.0925 0.6028 0.0967 6.5750 0.3528 0.3084 1.2108 2.5159 1.6284 2.3156 6.7000 0.2053 0.2124 13.1357 1.7283 1.1095 2.7540 0.0148 0.9658 0.0631 0.0734 4.4463 13.5721 15.6481 15.0839 57.3340 65.1708 60.0372 2.0697 4.0840 87.8325 7.3439 94.3681 4.2646 8.9489 67.2960 5.4183 84.0652 17.5683 8.4425 8.2374 0.6352 0.0498 21.2276 23.6271 2.4769 37.9647 2.3100 0.1020 0.8111 16.3906 3.7847 41.3573 41.9676 362.1391 122.9333 20.1372 66.1477 12.6140 8.7281 7.5730 99.1985 55.1265 0.0051 1.3028 6.4087 13.9796 41.4301 27.1235 219.1909 8.3106 51.3405 2.1011 0.5141 31.4756 3.7032 0.5335 41.1795 13.1785 9.1917 60.3640 217.8344 48.3755 155.0706 12.2564 75.6308 1.7993 0.7672 3.7517 0.1370 216.5289 193.9650 23.6581 17.2099 13.5859 24.6657 5.0858 1.5897 0.1007 8.0640 15.6722 0.9784 40.0530 22.1384 26.8217 21.3054 13.5742 28.1840 93.9265
temp: 298.150 k
press: 1.00000 atm
elementType: 8 8 8 8 7 6 6 6 6 6 6 6 6 6 6 6 6 6 6 6 6 6 1 1 1 1 1 1 1 1 1 1 1 1 1 1 1 1 1
symmnumber: 1
zpe: 800265.4 jmol-1
zpe.correction: 0.304805 hartree
zpe.thermalcorrener: 0.323509 hartree
zpe.thermalcorrenthalpy: 0.324453 hartree
zpe.thermalcorrgfe: 0.256124 hartree
zpe.sumelectzpe: -1012.088524 hartree
zpe.sumelectthermal: -1012.069820 hartree
zpe.sumelectthermalent: -1012.068875 hartree
zpe.sumelectthermalfe: -1012.137205 hartree
dipole: 1.3919 -0.1805 -2.5167
dipole: 2.8816
quadrupole: -116.5338 -117.6886 -128.4033
quadrupole: -5.5997 -1.2211 -2.3921
quadrupole: 4.3415 3.1866 -7.5281 -5.5997 -1.2211 -2.3921
hfenergy: -1012.3933289 hartree
pointgroup: C01 [X(C17H17N1O4)]
dipole: 0.515013 0.3196436 0.958072 debye
polarizability: 254.3847968|18.1802384|187.610934|28.6492606|-27.4519287|152.9803748 unknown
InChI: InChI=1S/C17H17NO4/c1-17(15(19)20,14-10-6-3-7-11-14)18-16(21)22-12-13-8-4-2-5-9-13/h2-11,18-19H,12H2,1H3
charge 0 multiplicity 1
39 atoms
O  1.543774 0.173979 -0.3586
O  -1.815317 2.548564 1.248953
O  -3.68094 2.771011 -0.111353
O  0.026065 -0.765911 -1.901279
N  -0.610764 0.859474 -0.299222
C  -2.05116 0.957454 -0.60312
C  -2.857326 -0.269471 -0.069271
C  -2.288079 1.18412 -2.121658
C  -2.618262 2.179947 0.159135
C  -2.245957 -1.23823 0.761017
C  -4.231964 -0.40837 -0.390738
C  0.266561 0.020471 -0.949974
C  -2.987454 -2.340088 1.242857
C  -4.972762 -1.508046 0.092698
C  -4.352742 -2.482046 0.909036
C  2.617979 -0.6640 -0.984742
C  3.904431 -0.368042 -0.253326
C  4.677121 0.772051 -0.591352
C  4.358979 -1.223307 0.78111
C  5.87824 1.055185 0.094858
C  5.561806 -0.945067 1.468859
C  6.323793 0.195982 1.127095
H  -1.693123 2.047629 -2.466971
H  -1.973412 0.287874 -2.676155
H  -3.349573 1.396656 -2.317509
H  -0.250363 1.40231 0.488978
H  -1.189959 -1.137279 1.029313
H  -4.73338 0.348356 -1.002834
H  -2.4964 -3.086634 1.877011
H  -6.033439 -1.601737 -0.16544
H  -4.927113 -3.337175 1.282305
H  2.671316 -0.402115 -2.056838
H  2.322144 -1.724793 -0.902132
H  -2.239188 3.301746 1.740486
H  4.332629 1.438821 -1.390951
H  3.768258 -2.107935 1.048609
H  6.467417 1.938717 -0.174992
H  5.904195 -1.615049 2.26532
H  7.257974 0.412447 1.657515
