program: Gaussian 09
title: 000226562
version: EM64L-G09RevD.01
frameworkgroup: C1[X(C9H14O6)]
method: RPBEPBE
basis: SDD
operation: Freq
keyword: #pfreq=noraman
keyword: PBEPBE/SDD
title: #p freq=noraman PBEPBE/SDD
converged: YES YES NO NO
title: Mulliken charges:
elementType: O O O O O O C C C C C C C C C H H H H H H H H H H H H H H
charge: -0.426592 -0.223411 -0.415620 -0.413308 -0.227956 -0.234900 0.286138 -0.465634 -0.456530 -0.745378 -0.512062 -0.524602 0.123226 0.174265 0.173293 0.236657 0.257648 0.241688 0.224321 0.242578 0.228263 0.225020 0.266616 0.267110 0.257620 0.302257 0.382347 0.379743 0.377202
chargesum: 0.00000
title: Mulliken charges with hydrogens summed into heavy atoms:
elementType: O O O O O O C C C C C C C C C
charge: -0.044245 -0.223411 -0.035876 -0.036106 -0.227956 -0.234900 0.286138 0.028671 0.009480 -0.049517 0.021664 0.035275 0.123226 0.174265 0.173293
polarizability: 1.20106817e+02 -7.48006706e-01 1.13216598e+02 -2.10823536e+00 -3.84874137e+00 1.07013266e+02
1716.lowfreq: -9.6180 -6.9944 0.0008 0.0009 0.0010 15.5039 15.8875 20.1434 29.5859
frequency: 15.5058 19.3288 29.5111 45.1618 58.3777 90.4557 99.8219 115.3721 146.7197 197.8337 218.0428 229.9788 243.4052 264.5381 311.2267 342.9553 361.9243 441.8455 475.7911 504.6245 507.6904 526.5732 557.8882 588.2271 595.6940 607.2017 639.0731 645.8592 725.0781 732.4105 759.0690 779.2116 859.6996 872.7873 890.7136 939.4697 973.2896 1013.9031 1032.8704 1039.4916 1044.2172 1074.7842 1088.3996 1118.5264 1138.3159 1168.2676 1203.8330 1230.5259 1245.3496 1252.9746 1275.8277 1292.0158 1306.6901 1314.7580 1331.2791 1374.1791 1378.5484 1393.4587 1441.3370 1448.4167 1468.9257 1474.1265 1479.2548 1489.3017 1643.3051 1664.7234 1667.9180 2989.4813 2995.7080 3000.7800 3013.8416 3015.6882 3053.6349 3056.9934 3074.8684 3080.4505 3083.9270 3101.6562 3511.1953 3512.0055 3513.0953
redmass: 12.6046 11.5905 7.4556 10.7821 3.4958 2.5839 4.8683 3.8603 2.8548 3.4138 3.4971 1.2247 3.6870 3.3671 3.5561 4.1051 3.2225 3.9180 3.3253 2.2707 1.8685 3.2652 3.7994 2.6994 2.4992 1.6842 1.3537 1.3687 3.6998 4.9022 1.5755 1.4644 3.6657 3.5251 2.9735 2.0818 1.6380 1.9531 3.0154 2.8814 2.5367 2.2192 2.4959 2.6271 1.6172 1.6404 1.4055 1.7570 1.4813 1.5691 1.8562 1.2931 1.3296 1.7031 1.6270 1.5207 1.6923 1.3307 1.0884 1.0815 1.0753 1.0627 1.0724 1.0684 8.8105 7.9604 8.2155 1.0354 1.0633 1.0627 1.0629 1.0601 1.0967 1.0940 1.1008 1.1003 1.0992 1.1007 1.0639 1.0639 1.0641
irintensity: 1.2995 1.4923 0.0818 0.6436 0.2719 0.3984 0.7735 2.9840 1.1568 1.0585 0.1676 0.5895 0.7458 0.0334 2.1729 0.6504 2.8549 21.0324 25.2439 69.4006 30.2924 21.6213 29.2047 45.8035 36.1093 73.6995 121.4026 119.5783 12.4976 22.8464 22.4276 27.5402 3.3258 4.0512 5.2888 20.6667 7.9597 107.2230 219.3366 153.1567 202.2980 58.3736 70.1966 31.8527 9.2006 2.2121 2.5830 3.4424 2.1782 0.7634 14.0264 21.8620 12.7523 88.2746 41.2947 17.2255 39.5840 28.8941 44.4388 1.0954 8.0509 19.4728 2.9913 37.5769 217.1346 115.3417 295.9893 17.7205 6.2703 9.3344 3.8326 21.5728 3.9819 1.0353 12.3103 21.4129 38.1748 19.7756 23.6597 22.4923 27.1281
temp: 298.150 k
press: 1.00000 atm
elementType: 8 8 8 8 8 8 6 6 6 6 6 6 6 6 6 1 1 1 1 1 1 1 1 1 1 1 1 1 1
symmnumber: 1
zpe: 595209.2 jmol-1
zpe.correction: 0.226703 hartree
zpe.thermalcorrener: 0.243603 hartree
zpe.thermalcorrenthalpy: 0.244547 hartree
zpe.thermalcorrgfe: 0.178407 hartree
zpe.sumelectzpe: -801.551618 hartree
zpe.sumelectthermal: -801.534718 hartree
zpe.sumelectthermalent: -801.533773 hartree
zpe.sumelectthermalfe: -801.599914 hartree
dipole: -1.7145 0.5062 0.5315
dipole: 1.8650
quadrupole: -89.6805 -78.0195 -96.2618
quadrupole: -1.1002 -6.6748 2.2978
quadrupole: -1.6932 9.9678 -8.2746 -1.1002 -6.6748 2.2978
hfenergy: -801.7783208 hartree
pointgroup: C01 [X(C9H14O6)]
dipole: -0.6692664 0.210251 0.2151016 debye
polarizability: 120.0386348|-0.8979441|113.2278536|-2.2919722|-3.8179135|107.0701934 unknown
InChI: InChI=1S/C9H14O6/c1-9(8(14)15,4-2-6(10)11)5-3-7(12)13/h10,12,14H,2-5H2,1H3
charge 0 multiplicity 1
29 atoms
O  -0.340895 3.182604 -0.817641
O  1.825071 2.37563 -0.800092
O  -3.816046 -2.033065 0.562658
O  3.164416 -2.443594 -1.166436
O  -3.190502 -1.169565 -1.499339
O  2.903312 -2.173665 1.123429
C  0.049936 1.14464 0.461808
C  -1.201546 0.536101 -0.255317
C  1.158479 0.095856 0.767245
C  -0.369953 1.833816 1.79952
C  -1.881774 -0.601778 0.531943
C  1.659879 -0.708932 -0.447038
C  0.633802 2.247726 -0.437217
C  -2.993349 -1.255988 -0.267978
C  2.613005 -1.814071 -0.039291
H  -0.924983 0.158915 -1.257325
H  -1.930784 1.34569 -0.431932
H  2.020487 0.61927 1.219168
H  0.788669 -0.600435 1.542267
H  -1.1751 2.568218 1.62984
H  0.488054 2.35632 2.259762
H  -0.722469 1.077165 2.522536
H  -1.162448 -1.403218 0.793214
H  -2.308824 -0.253675 1.488702
H  0.830228 -1.183892 -1.006026
H  2.17866 -0.050988 -1.166937
H  0.082798 3.884482 -1.382509
H  -4.517064 -2.474231 0.009434
H  3.778942 -3.167837 -0.86685
