program: Gaussian 09
title: 000238050
version: EM64L-G09RevD.01
frameworkgroup: C1[X(C5H9BrO3)]
method: RPBEPBE
basis: SDD
operation: Freq
keyword: #p
keyword: freq=noraman
keyword: PBEPBE/SDD
title: #p freq=noraman PBEPBE/SDD
converged: YES YES NO NO
title: Mulliken charges:
elementType: Br O O O C C C C C H H H H H H H H H
charge: 0.023976 -0.281189 -0.418517 -0.197046 0.047175 -0.581453 -0.713486 0.288382 -0.508734 0.236548 0.316652 0.208698 0.257058 0.243490 0.255462 0.205112 0.231002 0.386872
chargesum: 0.00000
title: Mulliken charges with hydrogens summed into heavy atoms:
elementType: Br O O O C C C C C
charge: 0.023976 -0.281189 -0.031646 -0.197046 0.283723 -0.264801 -0.004240 0.288382 0.182841
polarizability: 9.16252480e+01 -6.86475502e+00 6.88969349e+01 6.78092098e+00 -8.44637430e-01 7.34609740e+01
1716.lowfreq: -12.0960 -8.2741 -0.0004 0.0003 0.0003 2.1518 45.7538 68.1338 125.4827
frequency: 45.7165 68.1224 125.4788 145.2985 170.7815 176.4534 203.1882 211.0677 272.6975 287.8544 333.7291 436.5386 472.6062 550.4555 612.4316 701.9066 718.0980 767.7836 865.7223 895.4695 998.7980 1021.9670 1050.1510 1095.4525 1097.9897 1121.1877 1171.3892 1187.0234 1212.6685 1274.6377 1311.9618 1339.8101 1393.1554 1437.3138 1456.7763 1460.8282 1477.2907 1480.5912 1682.2419 2956.1732 2961.3280 3001.2640 3058.3129 3093.1525 3101.9352 3110.6607 3116.0104 3514.5969
redmass: 5.0520 6.4838 2.9162 4.5821 3.3046 6.1684 1.1306 1.3017 4.0928 3.4370 4.0759 3.9214 3.2401 3.3659 1.4560 3.5945 5.7520 3.8812 3.4661 2.7374 3.0388 2.6343 2.9074 1.9219 1.5908 1.3162 1.5616 1.2768 1.2896 1.4758 1.4358 1.4740 1.2139 1.1231 1.0643 1.0448 1.0511 1.0500 9.2957 1.0358 1.0840 1.0361 1.0986 1.0880 1.0974 1.1021 1.1008 1.0641
irintensity: 2.0738 0.4643 6.2623 1.7327 1.6795 1.4146 2.0720 2.5506 1.7404 3.0032 0.9855 3.8601 9.4165 56.6166 157.3898 28.5709 11.8297 26.7479 4.5884 0.0507 44.6542 234.2560 59.9423 51.2603 15.2380 6.2920 13.2997 8.1516 21.6745 26.9298 5.8250 15.2036 21.3849 7.5339 4.9115 9.8463 10.2732 9.0600 192.6497 52.7923 34.5884 16.9305 30.5165 2.9491 20.8081 27.7048 14.6459 30.9510
temp: 298.150 k
press: 1.00000 atm
elementType: 35 8 8 8 6 6 6 6 6 1 1 1 1 1 1 1 1 1
symmnumber: 1
zpe: 360351.5 jmol-1
zpe.correction: 0.137251 hartree
zpe.thermalcorrener: 0.148223 hartree
zpe.thermalcorrenthalpy: 0.149167 hartree
zpe.thermalcorrgfe: 0.099398 hartree
zpe.sumelectzpe: -434.313883 hartree
zpe.sumelectthermal: -434.302911 hartree
zpe.sumelectthermalent: -434.301966 hartree
zpe.sumelectthermalfe: -434.351736 hartree
dipole: -1.3833 -0.3363 -1.5416
dipole: 2.0984
quadrupole: -65.3636 -56.8705 -63.3882
quadrupole: -4.9177 0.1535 -1.3419
quadrupole: -3.4895 5.0036 -1.5141 -4.9177 0.1535 -1.3419
hfenergy: -434.4511338 hartree
pointgroup: C01 [X(C5H9Br1O3)]
dipole: -0.0416936 -0.7048459 0.4277923 debye
dipolederiv: -0.1354928 0.0153623 0.0161967 -0.0563333 -0.4869221 -0.0796377 -0.0016072 -0.0861943 -0.1115204 -0.7117419 0.0468907 -0.2057813 0.0951181 -0.4774986 0.1927557 -0.2828968 0.1485757 -0.6926037 -0.7486034 0.4511294 -0.018379 0.4050801 -0.9088963 0.0176651 0.0533253 -0.1439548 -0.2934015 -0.4445515 0.0960426 0.1161373 0.1669409 -0.5707548 0.1296304 0.0305556 0.2868108 -0.7836876 0.6450581 0.2164471 0.1418354 0.1552842 0.1726806 -0.1064319 0.2524031 -0.0530703 0.5964764 -0.139845 -0.0876085 0.0626111 -0.1047382 0.6923885 0.2399924 0.1355874 0.0918989 -0.1754702 -0.0477618 -0.1103299 -0.0198889 0.0215493 -0.1027014 0.0826479 -0.0447488 0.0299137 0.0183812 0.8021284 -0.6205208 -0.2244002 -0.5736902 0.935019 -0.280083 -0.2938037 -0.0862032 1.0966981 0.4315562 -0.0826171 0.0811297 -0.2143954 0.3364988 -0.1686019 0.0620908 -0.0600429 0.324962 -0.0736758 0.04781 0.1022942 0.0358779 -0.0125005 -0.0771132 0.0095938 -0.035173 -0.0780745 0.0310293 0.0339636 -0.0597921 0.0638806 -0.0549653 0.0097011 -0.0315952 -0.0260004 0.0200001 0.0618439 0.0149911 -0.0993225 -0.0021789 0.0721513 -0.0314267 -0.0918873 0.0138121 -0.1157989 0.0356291 0.0839446 0.0616534 0.0566425 0.0788226 -0.0307611 0.0824687 -0.0740006 0.0323117 -0.0560096 -0.1141903 0.0186863 -0.1003539 -0.0126942 0.0181598 0.0078687 0.0258601 0.1083036 0.0152637 -0.0921616 0.042936 -0.019259 -0.0586912 0.0881008 0.0237631 0.0473095 0.0637146 -0.0477672 0.0809191 0.0565358 0.1124829 0.0052971 0.0092439 0.1536293 -0.0725147 -0.0663973 0.0102262 -0.0127604 -0.1240676 -0.044424 0.0540312 -0.0628008 -0.140839 -0.0333253 -0.0569982 0.3727141 0.032688 0.0516157 0.0025164 0.3387351 0.0489593 0.0760921 0.0262986 0.1131047 unknown
polarizability: 67.9275492|-5.6142357|94.3186311|-0.4622798|1.7762494|71.7369766 unknown
InChI: InChI=1S/C5H9BrO3/c1-3(9-2)4(6)5(7)8/h3-4,7H,1-2H3
charge 0 multiplicity 1
18 atoms
Br -0.05989 2.245687 1.18972
O  -1.700773 -0.735846 -0.410589
O  1.755117 -1.038685 -0.478327
O  0.847196 0.815818 -1.547821
C  -1.07006 -0.562524 0.894482
C  0.255981 0.277649 0.82096
C  -0.780063 -1.980858 1.41392
C  0.951153 0.110074 -0.530128
C  -2.417735 0.442672 -0.929194
H  -1.760035 -0.03538 1.588339
H  0.938415 -0.035144 1.625129
H  -0.373955 -1.948906 2.440575
H  -0.055729 -2.495299 0.761025
H  -1.71954 -2.55749 1.421258
H  -1.716912 1.230328 -1.259313
H  -3.108213 0.854261 -0.164616
H  -2.995907 0.07487 -1.79132
H  2.151049 -1.202925 -1.377401
