program: Gaussian 09
title: 000226550
version: EM64L-G09RevD.01
frameworkgroup: C1[X(C14H18O3)]
method: RPBEPBE
basis: SDD
operation: Freq
keyword: #pfreq=noraman
keyword: PBEPBE/SDD
title: #p freq=noraman PBEPBE/SDD
converged: NO YES NO NO
title: Mulliken charges:
elementType: O O O C C C C C C C C C C C C C C H H H H H H H H H H H H H H H H H H
charge: -0.442387 -0.407320 -0.235858 -0.212224 -0.449851 -0.448662 -0.442071 -0.441500 -0.057471 0.554120 -0.477125 -0.396158 -0.414742 -0.384344 0.441239 -0.615969 0.211251 0.200642 0.219466 0.204358 0.206139 0.220275 0.225664 0.181626 0.181653 0.225801 0.219733 0.233447 0.228935 0.318889 0.232038 0.256760 0.246420 0.240775 0.376453
chargesum: 0.00000
title: Mulliken charges with hydrogens summed into heavy atoms:
elementType: O O O C C C C C C C C C C C C C C
charge: -0.123498 -0.030867 -0.235858 -0.011582 -0.026027 -0.022247 -0.034782 -0.034045 0.162261 0.554120 -0.243678 -0.167223 -0.182705 -0.127585 0.441239 -0.128775 0.211251
polarizability: 2.17625442e+02 -3.79544777e-01 1.31181401e+02 1.02247381e+00 1.50162004e+01 1.25627313e+02
1716.lowfreq: -22.4122 -4.1309 -0.0003 0.0006 0.0006 5.3828 17.5125 26.0001 37.2499
frequency: 10.3050 25.4140 37.0604 50.3518 64.3303 98.8927 164.8126 190.4456 210.7949 233.6158 261.4156 283.2575 326.1282 338.2641 370.2337 396.5145 408.1159 432.3394 451.9400 457.3632 488.9944 522.6839 543.1317 570.7204 636.1504 638.6685 698.4026 734.5100 764.2719 784.4476 805.2212 825.1107 838.1929 849.1818 870.6970 883.3771 898.5133 929.6356 949.3498 951.0430 966.2019 975.2661 1007.8519 1015.3903 1035.2945 1056.0607 1056.8079 1084.2196 1097.2082 1119.7416 1146.3011 1179.2626 1181.9644 1194.5150 1204.8916 1211.1671 1214.8567 1242.9035 1269.4876 1270.3253 1288.8169 1294.8642 1308.7938 1312.2180 1328.2899 1331.1298 1345.6347 1347.1600 1356.8598 1371.3884 1386.8859 1416.0883 1454.8604 1457.3189 1461.3801 1468.9197 1475.0304 1504.7998 1583.1816 1621.2048 1661.6565 2950.2738 2953.2101 2955.9603 2973.7859 2978.9503 3018.4913 3021.9760 3036.8083 3042.6853 3043.1533 3054.1764 3100.8981 3114.1394 3120.6491 3137.5484 3146.6153 3504.3622 3540.5858
redmass: 4.0521 5.3751 7.8053 4.7863 4.0282 5.9758 4.0586 4.9893 1.7788 5.0269 2.9382 1.3223 3.0389 2.8396 4.3852 2.4260 2.8214 2.0520 2.6139 3.3459 2.7865 3.4117 2.6355 3.4803 5.7362 1.6032 3.1710 3.3786 2.9652 1.4613 2.5794 2.3058 3.3060 1.2552 3.1848 2.8723 1.3838 1.9143 2.8086 1.7590 1.6560 1.3819 2.9233 2.6897 2.1191 1.1642 1.8784 1.7991 2.8529 1.4119 2.2431 1.2209 1.3372 1.1529 2.9068 1.3276 2.0532 1.3894 1.4482 1.4650 1.4026 1.3721 1.2579 1.7411 1.3166 1.5164 1.5134 1.4255 1.4808 1.2683 4.7189 2.3581 1.0987 1.0886 1.0897 1.0869 1.1009 2.5509 6.5266 6.3941 8.4909 1.0667 1.0772 1.0708 1.0614 1.0631 1.0619 1.0847 1.0975 1.0985 1.0981 1.0985 1.1003 1.0873 1.0872 1.0962 1.0967 1.0638 1.0658
irintensity: 0.0062 0.6011 1.7974 0.4520 1.8251 0.9307 0.9088 0.4037 6.0268 0.4023 4.0144 53.0398 2.4080 70.2064 1.2705 5.4914 0.2359 6.8453 2.6322 3.1103 6.0550 22.4807 16.5486 39.6046 9.5954 112.5218 56.4328 1.3782 4.3430 0.0029 17.6876 37.9621 13.6369 0.5614 12.7434 4.7538 10.5631 26.7142 12.3451 8.2156 1.3732 0.4880 148.9356 10.9064 3.2763 15.9880 188.4885 9.4136 1.3296 25.0050 7.3157 30.2841 11.3164 0.4994 3.9660 0.4685 1.5427 6.6061 2.6485 7.3061 6.7831 0.1048 0.1649 32.8037 1.8684 37.0832 3.1722 0.1400 20.4505 29.6439 2.0517 7.1505 16.6269 3.8933 8.6851 24.1062 0.0558 44.1532 0.2247 6.6358 205.2874 11.8391 4.1558 59.9938 16.6853 51.3715 13.7013 13.2409 64.1528 15.1532 17.9226 82.4485 5.5604 11.8677 19.0198 27.1465 1.7660 21.5973 6.9681
temp: 298.150 k
press: 1.00000 atm
elementType: 8 8 8 6 6 6 6 6 6 6 6 6 6 6 6 6 6 1 1 1 1 1 1 1 1 1 1 1 1 1 1 1 1 1 1
symmnumber: 1
zpe: 765576.3 jmol-1
zpe.correction: 0.291593 hartree
zpe.thermalcorrener: 0.307854 hartree
zpe.thermalcorrenthalpy: 0.308799 hartree
zpe.thermalcorrgfe: 0.244738 hartree
zpe.sumelectzpe: -768.692894 hartree
zpe.sumelectthermal: -768.676632 hartree
zpe.sumelectthermalent: -768.675688 hartree
zpe.sumelectthermalfe: -768.739749 hartree
dipole: -0.9603 2.3026 1.7063
dipole: 3.0226
quadrupole: -110.3498 -101.7911 -99.0230
quadrupole: 5.2835 1.0546 -1.1823
quadrupole: -6.6285 1.9302 4.6983 5.2835 1.0546 -1.1823
hfenergy: -768.9844865 hartree
pointgroup: C01 [X(C14H18O3)]
dipole: -0.40727 0.4038403 1.0417082 debye
polarizability: 217.4991299|-1.7141349|115.9542988|3.0283601|8.7724441|140.9807276 unknown
InChI: InChI=1S/C14H18O3/c15-13-7-5-12(6-8-13)11-3-1-10(2-4-11)9-14(16)17/h1-4,12-13,15-16H,5-9H2
charge 0 multiplicity 1
35 atoms
O  6.03922 -0.620936 -0.250699
O  -5.389552 -0.998239 0.505189
O  -4.676162 -1.004931 -1.704889
C  1.803116 0.233562 0.497558
C  2.623385 1.184322 -0.422992
C  2.258934 -1.239153 0.280485
C  4.147083 1.011577 -0.211923
C  3.783494 -1.404588 0.488918
C  4.58175 -0.452413 -0.424982
C  0.297378 0.399127 0.308744
C  -0.531721 0.798739 1.385636
C  -0.321455 0.149201 -0.946059
C  -1.928056 0.945841 1.220724
C  -1.712337 0.296676 -1.117232
C  -2.533976 0.700242 -0.033402
C  -4.043911 0.873988 -0.21881
C  -4.711658 -0.441679 -0.588947
H  2.047453 0.501712 1.548018
H  2.328184 2.233904 -0.234222
H  2.37332 0.972289 -1.482574
H  1.992544 -1.554998 -0.748822
H  1.704477 -1.906586 0.967058
H  4.714109 1.666804 -0.898991
H  4.412403 1.316137 0.824241
H  4.038217 -1.180947 1.548012
H  4.094388 -2.44755 0.292774
H  4.422444 -0.734986 -1.482356
H  -0.080517 0.995995 2.366096
H  0.288056 -0.164954 -1.801912
H  6.269368 -0.381011 0.683902
H  -2.547627 1.251939 2.072252
H  -2.170945 0.087242 -2.090686
H  -4.243287 1.581303 -1.044327
H  -4.501892 1.26634 0.702195
H  -5.780326 -1.874765 0.237223
