program: Gaussian 09
title: 000226516
version: EM64L-G09RevD.01
frameworkgroup: C1[X(C19H18O6)]
method: RPBEPBE
basis: SDD
operation: Freq
keyword: #pfreq=noraman
keyword: PBEPBE/SDD
title: #p freq=noraman PBEPBE/SDD
converged: YES YES NO NO
title: Mulliken charges:
elementType: O O O O O O C C C C C C C C C C C C C C C C C C C H H H H H H H H H H H H H H H H H H
charge: -0.308401 -0.297176 -0.277184 -0.416499 -0.276571 -0.222344 0.413069 0.127482 -0.492154 0.461760 -0.344546 -0.427444 0.218550 0.182920 -0.344510 -0.354288 -0.403329 0.356808 -0.422607 -0.351627 0.076659 -0.529522 -0.530724 0.262672 -0.748906 0.258648 0.223872 0.250859 0.250540 0.325690 0.228539 0.256735 0.304194 0.250615 0.225408 0.229610 0.257317 0.222976 0.229591 0.376815 0.254310 0.247674 0.254516
chargesum: 0.00000
title: Mulliken charges with hydrogens summed into heavy atoms:
elementType: O O O O O O C C C C C C C C C C C C C C C C C C C
charge: -0.308401 -0.297176 -0.277184 -0.039685 -0.276571 -0.222344 0.413069 0.127482 -0.233506 0.461760 -0.120673 -0.176584 0.218550 0.182920 -0.093969 -0.028598 -0.174790 0.356808 -0.165872 -0.047433 0.076659 0.176111 0.179160 0.262672 0.007594
polarizability: 4.89082714e+02 1.24310050e+01 2.26627269e+02 1.19477212e+00 -1.14435046e+01 1.23788848e+02
1716.lowfreq: -10.0210 -3.9487 -0.9478 -0.0012 -0.0009 0.0007 12.2489 24.0147 29.5391
frequency: 11.5758 24.0019 29.5296 36.1578 45.2571 60.5514 71.3494 78.4349 83.0534 103.7643 110.4748 127.8253 138.9132 156.5056 163.0203 167.7995 174.8035 189.6304 226.2529 249.3334 263.7168 300.5507 317.0413 340.5641 344.8735 361.9211 382.9350 406.8368 422.5003 435.1140 452.0457 489.7255 511.2723 532.5221 542.9643 554.4812 576.7659 597.8183 612.4153 624.9770 651.5529 664.1746 709.1905 712.8703 733.7477 739.1379 749.5074 761.9713 792.2736 832.9463 841.0160 863.0642 867.8036 884.2878 897.7107 940.6576 941.9342 952.7248 956.3573 982.3831 992.7830 1001.6776 1008.6424 1015.4123 1039.8941 1047.7853 1092.0694 1112.6379 1113.1159 1123.7338 1148.3708 1152.0289 1154.1946 1160.8276 1175.0750 1205.3105 1218.4695 1222.3164 1250.5930 1268.2255 1290.3225 1319.9321 1345.8056 1367.5926 1384.4034 1394.2437 1417.1373 1423.1443 1430.2631 1440.4253 1451.8103 1453.0543 1457.0782 1459.3844 1476.8824 1482.8404 1487.5980 1488.0145 1555.9858 1559.1595 1582.1409 1607.6684 1609.0864 1623.7850 1661.7526 2971.5034 2973.8571 3008.6138 3067.1616 3071.4531 3083.0988 3096.5525 3120.6946 3122.5675 3126.5003 3137.2246 3145.3897 3161.1232 3162.8071 3167.4581 3184.4861 3210.6710 3510.0146
redmass: 5.7810 4.4545 6.8620 5.1479 4.1340 4.2543 2.8296 4.8012 1.4147 3.1274 3.6103 4.6187 3.9215 1.3949 2.6856 6.3775 1.3994 2.6598 4.9884 5.0724 5.2530 5.6858 7.7311 6.2061 4.5519 4.7638 5.2740 3.3757 4.4805 3.5120 4.6989 3.3876 5.0693 2.6467 5.1598 3.1091 4.6486 4.1382 1.8426 3.9127 3.9935 5.2882 6.1523 5.9984 4.2770 4.7373 3.7013 6.9270 5.7168 1.5260 1.3474 5.1194 1.4265 7.0741 1.5595 2.1245 2.4875 1.9617 3.6362 1.3897 2.0153 3.0906 2.8153 1.3227 1.6413 2.6537 2.8838 1.2403 1.2445 1.4418 1.3889 2.3654 1.3384 1.7189 3.0190 1.9741 1.5009 2.5106 1.7499 2.4669 2.0067 1.5251 4.5705 5.7966 1.2359 3.0591 3.0280 1.1844 1.7654 1.3920 1.0604 1.0464 1.0538 1.0678 1.0677 2.5108 1.1319 2.1620 7.8011 7.1255 6.0923 6.3260 6.7166 6.5658 9.6983 1.0305 1.0310 1.0368 1.1045 1.1039 1.0860 1.0973 1.1025 1.1031 1.0906 1.0881 1.1012 1.0904 1.0947 1.0934 1.0960 1.0945 1.0638
irintensity: 0.2331 1.7973 2.5628 0.1389 1.8093 0.6075 0.5325 2.6402 0.4040 4.5775 8.0178 1.5777 3.5114 0.2658 0.6126 0.3474 0.2608 5.5139 2.5368 8.7554 7.8167 1.6666 6.1616 1.3931 1.0681 4.6101 2.3774 0.9932 2.0038 7.7037 13.7309 5.7964 2.2034 27.4805 18.0182 0.0420 32.3050 70.3563 42.7776 19.4623 48.6270 16.1011 9.7495 23.1582 0.6772 7.6673 14.0211 10.8601 5.7670 18.2271 30.7699 18.1748 50.9736 107.9937 22.5154 21.1839 56.8208 17.4153 22.2740 5.6719 200.3020 95.5109 33.5988 4.6574 9.3034 544.7113 47.5785 30.2168 1.9277 76.9740 52.8603 601.7231 14.9627 9.7364 386.6859 30.7164 67.6720 5.8902 103.4422 56.3192 79.3251 30.0399 91.4949 27.9260 77.3132 27.1337 17.8199 1.0052 134.5956 1.5809 24.8908 19.0592 13.7439 7.3087 8.4339 19.5813 0.6363 240.4878 56.1260 36.7734 122.0162 20.6433 2.3849 116.0859 213.0441 82.7398 83.3731 1.0083 28.9448 22.5280 17.6069 5.9684 27.0359 28.2280 12.0654 6.9248 12.8983 4.0515 9.0257 0.1021 32.2075 1.5216 54.4965
temp: 298.150 k
press: 1.00000 atm
elementType: 8 8 8 8 8 8 6 6 6 6 6 6 6 6 6 6 6 6 6 6 6 6 6 6 6 1 1 1 1 1 1 1 1 1 1 1 1 1 1 1 1 1 1
symmnumber: 1
zpe: 857653.3 jmol-1
zpe.correction: 0.326663 hartree
zpe.thermalcorrener: 0.351531 hartree
zpe.thermalcorrenthalpy: 0.352475 hartree
zpe.thermalcorrgfe: 0.268304 hartree
zpe.sumelectzpe: -1184.321642 hartree
zpe.sumelectthermal: -1184.296773 hartree
zpe.sumelectthermalent: -1184.295829 hartree
zpe.sumelectthermalfe: -1184.380000 hartree
dipole: 0.1679 0.5471 0.1117
dipole: 0.5831
quadrupole: -108.2992 -138.8977 -149.4515
quadrupole: -6.9312 -3.1713 3.7138
quadrupole: 23.9169 -6.6815 -17.2354 -6.9312 -3.1713 3.7138
hfenergy: -1184.6483044 hartree
pointgroup: C01 [X(C19H18O6)]
dipole: -0.054534 0.1168292 -0.189751 debye
polarizability: 486.5335784|-24.7987244|184.1636727|14.3904769|-53.3387382|168.8015796 unknown
InChI: InChI=1S/C19H18O6/c1-12(20)25-15-7-4-13(5-8-15)10-16(19(21)22)14-6-9-17(23-2)18(11-14)24-3/h4-11,21H,1-3H3
charge 0 multiplicity 1
43 atoms
O  -5.427819 1.588527 0.291989
O  -5.950247 -1.221389 0.942123
O  6.093026 -0.114899 0.153106
O  -1.680707 1.418329 -2.699543
O  0.447879 2.123668 -2.175254
O  6.571227 -1.74287 1.793502
C  -2.081302 0.048961 -0.342203
C  -0.693908 0.478724 -0.720078
C  -3.139339 0.988489 -0.229216
C  1.829154 0.005884 0.000067
C  0.361157 -0.038544 0.02196
C  -2.361096 -1.313574 -0.047097
C  -4.423979 0.593801 0.186208
C  -4.67799 -0.767056 0.529313
C  -3.642032 -1.713739 0.385892
C  2.665471 0.83749 -0.810014
C  2.479964 -0.888267 0.909128
C  4.669033 -0.156088 0.183715
C  4.063344 0.750766 -0.717031
C  3.87904 -0.988632 1.013852
C  -0.541499 1.403488 -1.8729
C  -6.54983 1.419827 -0.661791
C  -6.456313 -0.612753 2.196341
C  6.954449 -0.903858 0.955298
C  8.38515 -0.550645 0.619246
H  -2.985988 2.044487 -0.469009
H  0.002182 -0.687485 0.835607
H  -1.578234 -2.068003 -0.180802
H  -3.862569 -2.760675 0.617151
H  2.205451 1.557479 -1.488277
H  1.865515 -1.53296 1.549927
H  4.706134 1.388239 -1.331642
H  4.342792 -1.683612 1.713473
H  -7.045522 0.44199 -0.5211
H  -6.180313 1.505612 -1.701118
H  -7.247758 2.241974 -0.441735
H  -6.486652 0.488425 2.117995
H  -5.813379 -0.911304 3.045865
H  -7.469038 -1.022133 2.330531
H  -1.498414 2.04447 -3.452432
H  8.576759 -0.71944 -0.454422
H  9.067711 -1.165506 1.222831
H  8.568589 0.519204 0.819845
