program: Gaussian 09
title: 000226515
version: EM64L-G09RevD.01
frameworkgroup: C1[X(C19H16O6)]
method: RPBEPBE
basis: SDD
operation: Freq
keyword: #pfreq=noraman
keyword: PBEPBE/SDD
title: #p freq=noraman PBEPBE/SDD
converged: YES YES NO NO
title: Mulliken charges:
elementType: O O O O O O C C C C C C C C C C C C C C C C C C C H H H H H H H H H H H H H H H H
charge: -0.250327 -0.306079 -0.293130 -0.276982 -0.198406 -0.219127 0.115043 0.393304 0.405444 -0.398596 0.203473 0.058021 -0.494181 -0.394962 -0.409591 -0.540291 0.203821 0.386405 0.191100 -0.348801 -0.357273 -0.528440 -0.529691 0.262944 -0.746608 0.260457 0.294997 0.243472 0.237519 0.292574 0.307038 0.251813 0.244580 0.231604 0.232252 0.261455 0.230484 0.223048 0.256348 0.248973 0.256315
chargesum: 0.00000
title: Mulliken charges with hydrogens summed into heavy atoms:
elementType: O O O O O O C C C C C C C C C C C C C C C C C C C
charge: -0.250327 -0.306079 -0.293130 -0.276982 -0.198406 -0.219127 0.115043 0.393304 0.405444 -0.138139 0.203473 0.058021 -0.199184 -0.151490 -0.172072 -0.247717 0.203821 0.386405 0.191100 -0.041763 -0.105460 0.179996 0.185296 0.262944 0.015028
polarizability: 5.14970481e+02 1.47473615e+01 2.16245160e+02 -1.40463974e+00 4.07787248e+00 1.12094766e+02
1716.lowfreq: -3.7679 0.0007 0.0008 0.0013 2.1673 6.3031 19.5867 29.1894 36.7523
frequency: 19.4975 29.1636 36.7442 39.3514 63.9214 73.6605 79.2750 90.2673 100.2917 115.7423 134.9336 138.8368 153.1598 168.1476 177.5892 191.9322 222.4422 248.3181 252.9197 258.6284 295.0441 313.2869 345.4363 362.4624 369.4892 411.7450 428.5656 443.4627 447.9177 464.0266 489.9547 498.4848 543.9772 552.0703 569.0917 596.4358 609.2526 621.2694 637.1458 658.4798 709.6030 722.8284 727.6286 737.5213 745.0688 751.0506 773.4915 826.6864 833.0450 841.0806 873.7144 882.1943 887.0771 905.1913 927.6941 944.0417 951.5611 964.7920 972.8398 976.4254 993.7071 1037.9576 1040.5962 1096.2585 1104.9248 1112.4011 1115.0541 1147.3984 1153.4349 1155.3255 1166.1751 1170.2544 1212.2443 1219.1578 1239.7415 1256.0891 1262.7527 1305.9680 1328.1076 1367.4549 1385.8894 1394.5017 1401.4173 1423.4931 1428.3075 1442.0502 1451.3529 1452.7858 1457.7434 1460.6511 1475.7766 1482.5807 1486.9102 1491.6018 1550.4396 1556.8285 1597.9688 1607.1004 1620.2919 1663.5210 1666.3438 2971.2984 2977.5430 3009.7428 3066.3807 3077.2294 3097.4772 3121.6494 3126.6144 3133.5461 3138.6087 3141.4098 3146.4865 3165.2995 3188.1386 3189.7343 3218.1484
redmass: 6.4127 5.2385 5.4242 3.9452 2.9050 3.8409 1.3242 5.4102 3.3808 3.5383 4.6141 3.8908 1.1925 1.2738 3.8522 3.6986 6.3689 5.1265 6.5091 6.9797 7.5748 4.6013 4.3701 5.4560 6.5394 4.1325 5.0561 6.1686 5.3641 3.5611 3.4997 5.2531 7.0345 3.1229 6.1661 6.0832 6.9129 5.0191 4.8969 6.0238 6.3467 6.2377 4.4884 6.6291 3.8090 4.2232 6.5685 1.7082 1.4722 3.9463 6.0345 5.3195 1.5418 1.6171 1.5197 3.2216 1.8602 3.6797 5.3375 1.3504 1.9873 2.8044 1.6394 2.8886 2.1282 1.2430 1.2448 1.4629 1.5077 1.3397 2.4128 2.1442 4.1404 1.6598 2.3768 1.5349 1.6514 3.1281 3.0890 4.9229 1.2537 4.1362 3.4459 1.4237 2.6343 1.3679 1.0606 1.0461 1.0623 1.0605 1.0621 3.0048 1.0543 3.1551 9.0253 7.2884 6.6416 6.6758 7.4293 11.8302 9.8128 1.0304 1.0314 1.0369 1.1052 1.1029 1.0973 1.1022 1.1035 1.0903 1.0898 1.0913 1.1012 1.0958 1.0921 1.0932 1.0943
irintensity: 0.0541 4.7544 1.8998 1.5487 1.8491 2.6280 0.3963 1.2025 7.3488 4.8929 4.4891 2.1886 0.8313 0.1031 0.3167 6.0562 0.8879 3.7807 9.2217 2.6885 2.5850 3.0177 0.3228 1.3019 5.8108 1.7124 15.5068 3.8573 3.3656 2.1310 9.4513 0.6283 5.0121 1.5000 3.9845 66.4471 5.0581 3.9034 20.0963 4.5381 9.7703 14.7642 4.4129 66.4476 2.5493 9.3457 3.3910 19.8030 39.8368 8.3950 29.3153 72.1557 36.7828 49.5309 9.2225 50.7227 48.2957 82.7879 19.8871 0.3381 265.2718 79.2247 9.5435 57.5717 270.2449 28.9067 1.1196 5.9797 12.9815 11.7376 550.8696 393.8360 15.9127 41.0978 110.9126 6.1600 86.1722 176.1131 59.0627 12.2846 53.7879 24.0745 69.6095 4.2431 22.3002 30.9313 21.5177 19.4715 9.6511 9.2724 7.9014 7.3913 30.9236 201.3831 13.5725 48.6444 60.5065 21.5982 266.8793 278.9920 206.3949 70.3916 99.8127 0.5429 26.8950 23.3058 5.2074 28.2475 25.6041 17.2542 1.2531 10.2801 12.6071 7.7711 2.7507 1.4000 5.5960
temp: 298.150 k
press: 1.00000 atm
elementType: 8 8 8 8 8 8 6 6 6 6 6 6 6 6 6 6 6 6 6 6 6 6 6 6 6 1 1 1 1 1 1 1 1 1 1 1 1 1 1 1 1
symmnumber: 1
zpe: 801245.7 jmol-1
zpe.correction: 0.305178 hartree
zpe.thermalcorrener: 0.328696 hartree
zpe.thermalcorrenthalpy: 0.329640 hartree
zpe.thermalcorrgfe: 0.250004 hartree
zpe.sumelectzpe: -1183.163527 hartree
zpe.sumelectthermal: -1183.140010 hartree
zpe.sumelectthermalent: -1183.139066 hartree
zpe.sumelectthermalfe: -1183.218702 hartree
dipole: -1.0352 -2.3442 0.3693
dipole: 2.5891
quadrupole: -105.1470 -147.2291 -146.7386
quadrupole: -13.0711 3.8067 -0.6117
quadrupole: 27.8912 -14.1909 -13.7004 -13.0711 3.8067 -0.6117
hfenergy: -1183.4687058 hartree
pointgroup: C01 [X(C19H16O6)]
dipole: 0.3744394 -0.9275032 -0.1926725 debye
polarizability: 513.3731398|-26.1644401|217.9479866|3.5080604|1.628231|111.9892802 unknown
InChI: InChI=1S/C19H16O6/c1-11(20)24-14-6-4-13-8-15(19(21)25-17(13)10-14)12-5-7-16(22-2)18(9-12)23-3/h4-10H,1-3H3
charge 0 multiplicity 1
41 atoms
O  1.325956 1.678281 0.175593
O  -5.276898 1.510217 -0.972601
O  -6.237526 -1.089013 -0.013641
O  5.861585 0.288752 -0.093517
O  -0.787363 2.537454 0.323077
O  6.953769 -1.780446 -0.411943
C  -0.610668 0.111519 -0.003731
C  1.733096 -0.711495 -0.166372
C  -2.074811 -0.147696 0.014645
C  0.30703 -0.917902 -0.178407
C  2.217346 0.617107 0.016185
C  -0.117848 1.498241 0.170981
C  -3.015716 0.806527 -0.460367
C  2.692718 -1.748619 -0.334869
C  -2.570153 -1.391552 0.503323
C  3.590118 0.912484 0.035286
C  -4.393151 0.519783 -0.478568
C  4.506704 -0.145188 -0.132321
C  -4.870533 -0.749536 -0.038855
C  4.072474 -1.489165 -0.319603
C  -3.945359 -1.687408 0.471888
C  -6.142724 2.11356 0.068803
C  -6.941457 -1.028092 -1.318208
C  6.999822 -0.548373 -0.236138
C  8.24009 0.308313 -0.138528
H  -0.062559 -1.934658 -0.353281
H  -2.692857 1.791207 -0.804995
H  2.343025 -2.777137 -0.47903
H  -1.87973 -2.12331 0.936607
H  3.939166 1.937876 0.175178
H  4.798576 -2.291061 -0.447523
H  -4.330238 -2.642027 0.843938
H  -6.765009 1.343507 0.561591
H  -6.77737 2.839776 -0.461235
H  -5.522057 2.634107 0.82184
H  -6.841988 -0.029648 -1.778005
H  -7.994265 -1.250661 -1.088309
H  -6.533084 -1.798058 -1.999564
H  8.231878 1.079631 -0.927964
H  9.133171 -0.323804 -0.243172
H  8.263742 0.834206 0.83151
