program: Gaussian 09
title: 000238047
version: EM64L-G09RevD.01
frameworkgroup: C1[X(C17H20N2O2)]
method: RPBEPBE
basis: SDD
operation: Freq
keyword: #p
keyword: freq=noraman
keyword: PBEPBE/SDD
title: #p freq=noraman PBEPBE/SDD
converged: YES YES NO NO
title: Mulliken charges:
elementType: O O N N C C C C C C C C C C C C C C C C C H H H H H H H H H H H H H H H H H H H H
charge: -0.244306 -0.233537 -0.440234 0.001124 0.221524 0.200573 0.513575 -0.520005 -0.340914 -0.441474 -0.241200 -0.243993 -0.429695 0.475547 -0.685379 -0.683571 -0.420697 -0.371650 -0.191586 -0.191293 -0.270274 0.282323 0.245941 0.219767 0.209821 0.209829 0.207196 0.207224 0.202647 0.204297 0.232410 0.232394 0.203786 0.234068 0.234053 0.267678 0.214254 0.262590 0.221224 0.220336 0.225628
chargesum: 0.00000
title: Mulliken charges with hydrogens summed into heavy atoms:
elementType: O O N N C C C C C C C C C C C C C C C C C
charge: -0.244306 -0.233537 -0.172556 0.001124 0.221524 0.200573 0.513575 -0.237681 -0.094972 -0.221707 0.178450 0.170427 -0.227048 0.475547 -0.016278 -0.011664 -0.206443 -0.109060 0.029638 0.029042 -0.044647
polarizability: 4.60032229e+02 2.26725782e+01 2.31879299e+02 8.63644567e-02 -1.03637551e-01 9.95371595e+01
1716.lowfreq: -0.0007 -0.0004 0.0009 3.2782 3.8966 5.7815 18.6068 31.0828 33.9395
frequency: 18.5973 31.0491 33.9368 57.4465 67.8465 93.9040 100.4876 114.6366 115.9610 123.5739 184.9049 186.2497 218.4864 221.7526 236.1748 240.6964 244.9932 283.6980 298.3355 316.4966 359.0911 376.9642 401.0522 408.7750 464.8190 486.4682 506.1825 527.8047 571.0387 582.1988 613.2009 621.3571 626.6441 643.6214 694.5250 736.4751 741.4814 754.7510 757.5658 794.4325 825.2068 828.8670 832.5923 844.3412 883.0335 885.6116 894.1952 903.1136 903.5745 929.3932 962.2604 980.6569 984.5350 996.8097 1019.0305 1032.7859 1034.4843 1070.8264 1110.2560 1114.0343 1116.3328 1130.7400 1134.5563 1135.1235 1167.7790 1175.3155 1177.7642 1218.2401 1260.2476 1261.6437 1263.5325 1272.7318 1280.3273 1304.1902 1342.4440 1363.7026 1366.0020 1391.5918 1396.5042 1398.5864 1404.5061 1431.4149 1443.2377 1459.6708 1460.1113 1475.3384 1476.4938 1484.2011 1486.7192 1488.5170 1503.3991 1531.3608 1561.9126 1587.0692 1601.9845 1607.3881 1617.8598 2951.7059 2953.9321 2967.2985 2996.6958 2997.7681 3010.2174 3012.2399 3093.8502 3094.8643 3106.4910 3108.2354 3109.7702 3126.0305 3128.5548 3139.9833 3163.1877 3165.1611 3169.8292 3182.1599 3392.7914
redmass: 4.1111 3.8518 4.9201 4.5520 3.2486 3.4334 2.8882 4.3913 1.8629 2.0758 5.0344 4.6704 2.7076 4.5454 4.4758 1.1968 1.2636 4.8544 4.0294 4.4872 3.7495 4.7526 5.1144 2.9554 3.1060 5.4655 2.7468 5.4708 1.2582 5.8600 6.4147 6.3868 3.8178 5.7677 1.9029 5.1269 3.0616 4.3619 1.7387 1.4214 1.1160 1.2589 1.1131 4.3045 1.4544 3.3941 1.4565 3.3087 1.4100 1.5484 1.3531 5.9846 1.3050 2.9889 2.1446 2.7399 2.6399 1.9943 2.8115 2.3775 2.2302 2.2764 1.4347 1.4385 1.0644 1.5484 1.2873 2.0722 3.2248 1.1421 1.1429 1.3198 2.2531 1.5309 1.5437 1.4642 1.3397 2.9257 2.2330 1.2664 2.1369 4.4910 2.5609 1.0398 1.0400 1.1600 1.0576 2.1642 1.1734 1.0873 2.0162 2.3187 7.3501 6.4209 4.8845 5.9768 6.1678 1.0552 1.0554 1.0862 1.0362 1.0363 1.1074 1.1075 1.0989 1.0988 1.1013 1.1013 1.0876 1.0890 1.0866 1.0932 1.0984 1.0930 1.0911 1.0954 1.0745
irintensity: 0.1024 1.1607 0.3624 1.1609 4.3097 1.8643 4.7834 0.2511 1.0515 0.0520 0.0298 1.8630 17.5688 2.4486 5.7391 0.0589 0.0291 6.9671 8.1355 2.6858 0.4668 13.3113 0.8175 0.1167 2.6712 11.7831 23.1677 1.8503 51.0907 3.9438 4.4439 2.3168 20.5109 44.1136 45.6257 9.8468 0.4444 8.3893 79.9016 40.7111 9.9616 0.0849 0.1386 0.2101 1.2767 14.1326 11.4232 62.1979 28.1119 26.3062 0.0038 6.1213 1.4108 21.4791 2.1091 96.5391 42.6598 63.8065 190.5354 20.9579 12.7454 182.2261 3.5237 5.7138 1.0832 15.3127 44.3057 183.6129 406.6558 0.0253 0.0402 18.2661 204.3588 9.6577 44.6513 17.6008 11.6814 58.9366 11.5624 9.8374 33.5444 35.9808 30.7846 3.6330 19.6826 83.5303 21.5220 156.3791 43.1534 7.6925 149.0637 109.2815 92.5285 45.7272 27.0136 57.8999 262.6537 61.6196 21.8983 72.0081 23.9190 35.1141 33.1785 38.5565 30.9178 25.1473 30.9614 35.9478 15.9153 16.5831 1.4933 33.8058 45.4054 24.0146 4.9938 4.4953 0.4745
temp: 298.150 k
press: 1.00000 atm
elementType: 8 8 7 7 6 6 6 6 6 6 6 6 6 6 6 6 6 6 6 6 6 1 1 1 1 1 1 1 1 1 1 1 1 1 1 1 1 1 1 1 1
symmnumber: 1
zpe: 876519.3 jmol-1
zpe.correction: 0.333849 hartree
zpe.thermalcorrener: 0.354530 hartree
zpe.thermalcorrenthalpy: 0.355474 hartree
zpe.thermalcorrgfe: 0.282462 hartree
zpe.sumelectzpe: -918.171207 hartree
zpe.sumelectthermal: -918.150525 hartree
zpe.sumelectthermalent: -918.149581 hartree
zpe.sumelectthermalfe: -918.222593 hartree
dipole: -0.9001 -2.1503 0.0057
dipole: 2.3311
quadrupole: -108.8591 -101.9358 -131.8716
quadrupole: 2.6973 0.0265 -0.0265
quadrupole: 5.3631 12.2864 -17.6494 2.6973 0.0265 -0.0265
hfenergy: -918.5050555 hartree
pointgroup: C01 [X(C17H20N2O2)]
dipole: -0.3390586 -0.8513704 0.0362743 debye
polarizability: 458.8444035|26.3192768|232.5877688|-11.5541258|-4.6081728|100.0165148 unknown
InChI: InChI=1S/C17H20N2O2/c1-3-20-16-11-10-14(12-17(16)21-4-2)13-18-19-15-8-6-5-7-9-15/h5-13,19H,3-4H2,1-2H3
charge 0 multiplicity 1
41 atoms
O  -2.888923 1.783391 0.197363
O  -4.756778 -0.088201 0.302508
N  2.996469 -1.262097 0.105118
N  1.705635 -0.794503 0.129525
C  -2.421104 0.465741 0.218885
C  -3.438361 -0.549325 0.275584
C  -0.680767 -1.277621 0.214614
C  -1.066069 0.096382 0.18942
C  -3.055389 -1.908477 0.300188
C  -1.690105 -2.26929 0.270046
C  -1.87971 2.859664 0.138101
C  -5.831643 -1.098527 0.363623
C  0.725299 -1.679394 0.184544
C  4.094287 -0.38273 0.045083
C  -2.647968 4.178279 0.123873
C  -7.150722 -0.331089 0.384826
C  5.407473 -0.928898 0.023464
C  3.916572 1.027014 0.005956
C  6.526083 -0.072971 -0.036472
C  5.046565 1.867357 -0.053879
C  6.356962 1.331286 -0.075685
H  -0.272595 0.846819 0.14685
H  -3.815293 -2.693854 0.342805
H  -1.411489 -3.329676 0.289778
H  -1.212548 2.788824 1.021894
H  -1.265147 2.738926 -0.777853
H  -5.764815 -1.762993 -0.522767
H  -5.707763 -1.714491 1.278468
H  0.927931 -2.770071 0.209985
H  -1.942562 5.028111 0.079401
H  -3.315918 4.228859 -0.752705
H  -3.263481 4.278896 1.033889
H  -8.00041 -1.036581 0.431018
H  -7.197585 0.334932 1.262937
H  -7.254634 0.286567 -0.523232
H  3.183255 -2.275055 0.130207
H  5.549446 -2.01726 0.053468
H  2.901902 1.431758 0.023227
H  7.53291 -0.505626 -0.052698
H  4.902473 2.953715 -0.083829
H  7.227715 1.993511 -0.122223
