program: Gaussian 09
title: 000226508
version: EM64L-G09RevD.01
frameworkgroup: C1[X(C17H12O4)]
method: RPBEPBE
basis: SDD
operation: Freq
keyword: #pfreq=noraman
keyword: PBEPBE/SDD
title: #p freq=noraman PBEPBE/SDD
converged: YES YES NO NO
title: Mulliken charges:
elementType: O O O O C C C C C C C C C C C C C C C C C H H H H H H H H H H H H
charge: -0.250692 -0.277083 -0.196163 -0.218734 0.390544 0.127334 0.205657 -0.395974 0.342051 -0.392505 -0.539362 0.053670 0.387119 -0.348290 -0.364254 -0.392923 -0.235458 -0.240918 -0.236518 0.263379 -0.746420 0.261734 0.243623 0.292842 0.307392 0.274008 0.233594 0.230328 0.227940 0.231917 0.256491 0.249161 0.256510
chargesum: 0.00000
title: Mulliken charges with hydrogens summed into heavy atoms:
elementType: O O O O C C C C C C C C C C C C C C C C C
charge: -0.250692 -0.277083 -0.196163 -0.218734 0.390544 0.127334 0.205657 -0.134240 0.342051 -0.148882 -0.246520 0.053670 0.387119 -0.040898 -0.090246 -0.159329 -0.005129 -0.012979 -0.004601 0.263379 0.015741
polarizability: 4.25861107e+02 1.19953281e+01 1.87247595e+02 -2.08162875e+00 -5.80301096e+00 8.83010809e+01
1716.lowfreq: -10.8787 -5.9525 -0.0010 -0.0006 0.0005 3.8013 24.0510 31.0459 49.5951
frequency: 23.7908 31.0424 49.5324 66.6167 73.9168 80.9907 100.3149 132.6229 156.4072 203.7804 230.9905 253.5478 258.1412 299.5816 331.1164 368.0667 391.8514 402.6236 419.3436 445.1617 458.5214 500.9993 517.0162 547.2197 551.6067 602.2367 616.4738 622.5778 627.1590 671.0056 696.0483 714.9652 723.0633 738.9145 744.6239 776.7448 812.6096 832.2931 845.6615 854.7408 875.7636 886.8490 917.2688 932.1104 965.1992 974.5269 975.9105 988.3202 993.3153 997.0373 1020.1150 1040.5295 1042.9390 1089.1918 1104.6318 1153.8509 1167.8635 1175.4132 1200.6018 1212.6068 1226.8533 1257.9773 1298.1930 1315.6669 1347.6245 1379.4032 1385.1949 1398.0936 1426.0153 1436.3513 1451.3950 1452.4995 1480.5122 1490.3317 1550.6784 1579.9381 1599.0722 1608.4424 1620.7186 1664.9887 1667.0738 3009.3550 3097.0153 3122.1154 3133.0176 3137.5307 3141.3205 3146.5052 3146.6844 3163.2476 3186.2698 3189.7863 3218.6137
redmass: 6.6987 4.9411 4.2078 2.6380 5.5041 1.3733 5.9063 5.2458 5.5301 8.7469 4.9763 6.3293 7.0077 6.3113 4.3457 6.6224 5.4004 2.8595 3.8739 7.9883 2.9811 5.1507 4.2399 6.4639 3.1282 7.5502 6.5023 4.7939 6.7588 6.6718 1.8314 4.0257 6.2591 5.8250 4.2597 2.2909 5.1195 1.3719 1.3136 6.7948 5.9473 1.5449 1.4080 1.5190 3.4932 1.3950 1.3366 5.3335 1.9797 1.3618 4.2378 1.6413 2.2179 1.6472 2.1112 1.6925 3.2599 1.0539 1.1352 4.1284 1.5976 1.7508 3.0187 1.5664 1.9017 6.6846 1.2464 6.1821 4.3862 2.3469 1.0604 1.0462 2.5954 2.8098 9.4951 5.6619 6.6864 6.1211 7.3313 11.8634 9.8154 1.0369 1.0973 1.0863 1.0883 1.0911 1.0914 1.1011 1.0938 1.0993 1.0956 1.0932 1.0943
irintensity: 0.4347 5.7195 0.6371 1.3222 0.7220 0.0114 1.1093 2.5099 1.9192 1.9588 0.6371 0.4967 0.7894 1.2957 1.1588 0.9982 1.6169 0.1077 0.2814 5.9798 3.6188 0.9841 13.3646 7.2411 1.9816 20.4168 10.2051 7.5022 32.0733 1.5802 47.3633 13.8241 4.1775 36.9857 13.2234 52.3098 4.8146 28.8135 2.9191 6.0837 70.3143 39.6988 27.7557 8.9337 69.6644 2.1919 0.2380 2.4924 249.6696 0.2486 7.1699 9.5673 44.1579 19.7709 252.4965 22.3825 836.7650 0.3420 4.4027 19.6113 2.6395 50.0343 74.7238 13.4203 6.0385 2.3706 59.2449 40.3863 26.3403 21.5370 22.2780 19.5635 12.0848 57.6260 36.0289 8.6527 40.4736 29.7314 268.7341 303.3247 187.6473 0.4938 5.1361 7.7578 4.4590 6.2202 8.6848 11.3482 29.3501 38.0717 6.8104 1.3261 5.7594
temp: 298.150 k
press: 1.00000 atm
elementType: 8 8 8 8 6 6 6 6 6 6 6 6 6 6 6 6 6 6 6 6 6 1 1 1 1 1 1 1 1 1 1 1 1
symmnumber: 1
zpe: 638904.3 jmol-1
zpe.correction: 0.243346 hartree
zpe.thermalcorrener: 0.261040 hartree
zpe.thermalcorrenthalpy: 0.261984 hartree
zpe.thermalcorrgfe: 0.195666 hartree
zpe.sumelectzpe: -954.469801 hartree
zpe.sumelectthermal: -954.452107 hartree
zpe.sumelectthermalent: -954.451163 hartree
zpe.sumelectthermalfe: -954.517480 hartree
dipole: -1.7898 -2.7632 -0.3575
dipole: 3.3116
quadrupole: -94.8359 -125.4009 -122.7752
quadrupole: -20.4472 -3.6259 -4.4080
quadrupole: 19.5014 -11.0636 -8.4379 -20.4472 -3.6259 -4.4080
hfenergy: -954.7131468 hartree
pointgroup: C01 [X(C17H12O4)]
dipole: 0.667137 -0.9928205 -0.5164494 debye
polarizability: 424.5735977|-12.9079139|151.1027411|-17.2070217|48.7398624|125.7334438 unknown
InChI: InChI=1S/C17H12O4/c1-11(18)20-14-8-7-13-9-15(12-5-3-2-4-6-12)17(19)21-16(13)10-14/h2-10H,1H3
charge 0 multiplicity 1
33 atoms
O  0.101618 1.519401 0.905248
O  4.629414 0.295944 0.144031
O  -2.007192 2.26878 1.374629
O  5.709774 -1.562552 -0.833366
C  0.497058 -0.613256 -0.229536
C  -1.843022 0.119073 0.201068
C  0.987325 0.57792 0.381694
C  -0.929735 -0.805245 -0.291524
C  -3.311084 -0.101992 0.08448
C  1.450814 -1.541256 -0.733358
C  2.361686 0.846665 0.488871
C  -1.344201 1.349978 0.858236
C  3.27239 -0.09758 -0.026774
C  2.831607 -1.303812 -0.644058
C  -4.226504 0.368398 1.068117
C  -3.829441 -0.831997 -1.024486
C  -5.605991 0.094419 0.954032
C  -5.2083 -1.101765 -1.136797
C  -6.105209 -0.643231 -0.143474
C  5.763225 -0.454949 -0.266783
C  7.008105 0.317381 0.100923
H  -1.302898 -1.736532 -0.732347
H  1.095516 -2.464665 -1.204547
H  2.716357 1.765073 0.961687
H  3.553765 -2.020023 -1.033942
H  -3.85699 0.951355 1.914733
H  -3.154795 -1.158758 -1.824513
H  -6.292474 0.461832 1.724686
H  -5.584737 -1.654691 -2.004538
H  -7.17788 -0.848227 -0.230851
H  7.001519 1.3053 -0.391146
H  7.897677 -0.248787 -0.209307
H  7.037203 0.495198 1.189812
