program: Gaussian 09
title: 000226505
version: EM64L-G09RevD.01
frameworkgroup: C1[X(C15H12O4)]
method: RPBEPBE
basis: SDD
operation: Freq
keyword: #pfreq=noraman
keyword: PBEPBE/SDD
title: #p freq=noraman PBEPBE/SDD
converged: YES YES NO NO
title: Mulliken charges:
elementType: O O O O C C C C C C C C C C C C C C C H H H H H H H H H H H H
charge: -0.418299 -0.420273 -0.430727 -0.262114 0.378283 0.326347 0.156299 -0.222405 -0.347056 0.097477 -0.325725 -0.472163 -0.535576 -0.368392 -0.395732 0.326560 0.297257 -0.213170 -0.394145 0.215599 0.230704 0.210153 0.301838 0.252559 0.219349 0.256903 0.227842 0.223792 0.366370 0.363218 0.355227
chargesum: 0.00000
title: Mulliken charges with hydrogens summed into heavy atoms:
elementType: O O O O C C C C C C C C C C C C C C C
charge: -0.051929 -0.057055 -0.075500 -0.262114 0.378283 0.326347 0.156299 -0.006806 -0.116353 0.097477 -0.115573 -0.170325 -0.283017 -0.149043 -0.138829 0.326560 0.297257 0.014672 -0.170352
polarizability: 4.13849452e+02 5.19483136e+00 1.86506864e+02 -5.31049645e-01 -6.61215975e-01 6.88936123e+01
1716.lowfreq: -3.1351 -0.0006 -0.0001 0.0003 3.0630 5.1048 11.5532 22.3702 46.8878
frequency: 9.4044 22.3378 46.8810 61.6884 96.3264 153.1838 176.9749 179.1548 184.7128 216.0149 220.4590 265.1401 331.8481 338.1279 348.7044 394.0928 399.3815 404.5641 414.1882 433.2457 459.7220 474.7856 489.1167 506.9627 532.6402 539.5932 584.5414 615.4726 648.0044 673.4200 700.2650 721.4802 735.4492 739.2237 790.9880 813.6126 838.8575 844.4328 868.8371 872.3491 907.7846 937.7120 949.3877 950.9446 961.6955 976.4810 983.5733 1048.1259 1083.7494 1093.6070 1127.9118 1137.5843 1144.1166 1180.0557 1185.7691 1194.0691 1219.5025 1259.1413 1272.1555 1293.4598 1318.5738 1331.8397 1349.7954 1398.1778 1399.3048 1456.2008 1462.9390 1474.5166 1495.0782 1511.7053 1581.5256 1585.7337 1621.7222 1626.5427 1636.5498 3041.2195 3116.6947 3144.9117 3148.3807 3150.3039 3159.1281 3172.4466 3175.8647 3183.0990 3577.5578 3578.0077 3581.6672
redmass: 5.5525 6.5748 6.3203 5.6535 3.2656 6.2592 6.6738 5.6118 3.1186 4.8664 4.2871 8.6186 4.9629 2.3697 1.1283 5.9228 1.2516 5.0832 1.2979 3.1663 2.5536 4.9556 6.8702 6.3842 6.0941 5.1825 4.5824 4.5309 7.4209 2.4962 2.2532 7.5413 2.6871 6.8965 1.7897 1.5225 4.9674 1.7091 2.0524 1.4537 4.0504 1.4960 1.3458 3.7107 1.3393 1.2132 6.0530 2.3088 1.8249 1.7732 1.6025 1.4394 1.2961 1.2107 1.4470 1.5504 1.6414 3.0384 1.9108 1.3641 1.9312 2.2117 1.7081 7.9056 4.2856 3.0764 4.1704 2.5317 3.2860 8.4068 6.1322 6.3953 5.5390 6.0804 6.6453 1.0862 1.0888 1.0909 1.0896 1.0919 1.0923 1.0920 1.0937 1.0963 1.0660 1.0655 1.0660
irintensity: 0.2632 3.2308 0.9008 1.4601 0.0330 2.9656 0.7338 1.2136 1.3460 0.9111 0.1063 0.2994 14.4128 30.7420 152.8014 15.7792 0.1796 4.8040 223.0548 0.9692 45.3721 65.5473 12.8829 11.6652 4.4766 5.1109 3.7254 1.8847 13.9559 20.0177 8.3931 0.5637 25.0643 46.1818 37.5937 17.5836 88.1408 49.8743 27.8860 0.1316 51.3252 8.5642 5.5470 38.5674 4.3931 41.3489 9.3266 15.9974 6.5352 1.1978 331.9327 119.3479 349.3865 58.5719 29.0187 136.7429 37.7774 305.8104 224.5730 70.2573 172.7010 97.0438 6.6315 25.0554 21.0559 3.1754 69.8118 27.1358 83.7813 465.9455 68.3175 9.5214 349.7013 342.5856 130.7326 10.6192 13.9281 17.0711 14.5479 3.2985 2.9281 12.2727 14.8625 6.4307 107.5901 19.8529 46.3834
temp: 298.150 k
press: 1.00000 atm
elementType: 8 8 8 8 6 6 6 6 6 6 6 6 6 6 6 6 6 6 6 1 1 1 1 1 1 1 1 1 1 1 1
symmnumber: 1
zpe: 606102.9 jmol-1
zpe.correction: 0.230852 hartree
zpe.thermalcorrener: 0.247868 hartree
zpe.thermalcorrenthalpy: 0.248812 hartree
zpe.thermalcorrgfe: 0.183656 hartree
zpe.sumelectzpe: -878.334958 hartree
zpe.sumelectthermal: -878.317943 hartree
zpe.sumelectthermalent: -878.316999 hartree
zpe.sumelectthermalfe: -878.382154 hartree
dipole: -0.3974 -3.6354 0.0995
dipole: 3.6584
quadrupole: -70.9759 -111.0255 -116.6164
quadrupole: -19.8185 0.0301 -0.1144
quadrupole: 28.5634 -11.4863 -17.0771 -19.8185 0.0301 -0.1144
hfenergy: -878.5658105 hartree
pointgroup: C01 [X(C15H12O4)]
dipole: 0.1981609 -1.0536141 -0.9603871 debye
polarizability: 413.9503104|2.2744699|135.7042716|-0.3507057|58.1969576|119.5953462 unknown
InChI: InChI=1S/C15H12O4/c16-12-3-1-2-11(8-12)14(18)7-5-10-4-6-13(17)9-15(10)19/h1-9,16-17,19H
charge 0 multiplicity 1
31 atoms
O  3.348305 2.000308 1.69748
O  6.41315 -0.907095 -0.640702
O  -6.328461 0.426815 0.665959
O  -1.501766 1.48927 1.382925
C  2.402934 0.186384 0.259978
C  -2.715829 -0.08747 0.018283
C  3.502708 0.91431 0.831991
C  1.028112 0.554028 0.563416
C  2.736031 -0.901314 -0.608068
C  -1.441447 0.521277 0.548606
C  -0.134525 -0.012915 0.098037
C  -3.934469 0.406554 0.545573
C  4.841903 0.572006 0.549123
C  -2.746649 -1.108569 -0.973534
C  4.055879 -1.255451 -0.899929
C  5.113595 -0.508714 -0.31365
C  -5.163681 -0.111327 0.093944
C  -3.983337 -1.617966 -1.421078
C  -5.198316 -1.12858 -0.893559
H  0.837254 1.392718 1.255709
H  1.924963 -1.480783 -1.060219
H  -0.113559 -0.858292 -0.594838
H  -3.907655 1.19438 1.303759
H  5.639168 1.162761 1.013425
H  -1.824636 -1.504725 -1.407166
H  4.298982 -2.088787 -1.563772
H  -4.006722 -2.401012 -2.186494
H  -6.156575 -1.531916 -1.246394
H  2.396679 2.209309 1.869928
H  7.088474 -0.339303 -0.1921
H  -7.13901 0.0044 0.286966
