program: Gaussian 09
title: 000226497
version: EM64L-G09RevD.01
frameworkgroup: C1[X(C18H20N2O2)]
method: RPBEPBE
basis: SDD
operation: Freq
keyword: #p
keyword: freq=noraman
keyword: PBEPBE/SDD
title: #p freq=noraman PBEPBE/SDD
converged: YES YES NO NO
title: Mulliken charges:
elementType: O O N N C C C C C C C C C C C C C C C C C C H H H H H H H H H H H H H H H H H H H H
charge: -0.447605 -0.262523 -0.150491 -0.086487 0.452866 -0.398908 -0.399781 -0.375130 -0.350325 -0.659265 -0.658956 0.464975 -0.403716 -0.411188 -0.401680 0.259001 -0.369238 -0.343901 0.252666 -0.338638 -0.326133 0.101077 0.227861 0.224852 0.229445 0.224129 0.229812 0.230387 0.218930 0.240159 0.218151 0.217893 0.241536 0.218786 0.224101 0.271314 0.220610 0.253966 0.243802 0.268540 0.269677 0.379427
chargesum: 0.00000
title: Mulliken charges with hydrogens summed into heavy atoms:
elementType: O O N N C C C C C C C C C C C C C C C C C C
charge: -0.068178 -0.262523 -0.150491 -0.086487 0.452866 0.053806 0.053793 -0.145318 -0.119938 0.017976 0.019260 0.464975 -0.179615 -0.139874 -0.181070 0.259001 -0.115272 -0.100099 0.252666 -0.070099 -0.056456 0.101077
polarizability: 5.97757255e+02 5.16979234e+00 1.84686016e+02 -5.30812720e+00 -2.08883466e+01 1.30182609e+02
1716.lowfreq: -4.4328 -0.0010 -0.0007 0.0008 0.5484 3.4842 21.0378 25.9385 33.0617
frequency: 21.0136 25.7256 33.0253 58.3354 62.0312 79.5375 89.7100 101.7583 112.4746 123.3712 161.4631 184.0866 194.1642 217.2311 222.3633 241.9127 297.6530 308.5289 310.3901 357.2585 375.1879 405.5080 412.8737 422.3793 442.0677 457.8420 496.8813 510.7462 523.4594 527.0975 551.1403 582.5537 592.0703 627.7493 634.0394 684.0658 687.1084 725.8842 739.4843 762.5914 786.3243 788.3043 804.2484 823.4119 828.2111 833.8239 852.2954 872.8914 891.3496 923.7644 940.5767 977.5886 977.7475 987.9853 991.7619 992.8920 994.7350 1013.1882 1014.9642 1073.7748 1077.1776 1094.8561 1113.4087 1128.5891 1146.6262 1161.5799 1175.3768 1190.4432 1200.2451 1207.9881 1267.2920 1269.8295 1286.1848 1294.5939 1316.1091 1321.2298 1339.6825 1349.2074 1353.7812 1367.3792 1386.7009 1388.2087 1393.4468 1407.6008 1428.5525 1452.2199 1466.0321 1468.3538 1479.0671 1483.8320 1489.7110 1494.8128 1508.2104 1531.3943 1545.8883 1553.3117 1579.7455 1623.0857 1633.8510 1638.4376 2941.3758 2985.1468 2985.8092 2994.8315 3000.1830 3043.5123 3048.9394 3081.5007 3082.2591 3093.4162 3094.7931 3115.0939 3135.8644 3145.8490 3149.3900 3165.2192 3169.2654 3169.8347 3173.7800 3532.9332
redmass: 5.5792 4.3033 5.7544 4.9840 3.1425 5.7534 4.1564 3.5546 3.7923 3.8070 5.8116 4.7238 2.2437 1.0404 1.7121 2.9793 3.1598 3.3968 3.3966 4.7108 3.9192 3.7239 2.9674 3.2339 3.1465 6.0628 3.1669 3.5278 2.9244 3.1681 2.7646 1.2868 4.2178 7.1419 6.9895 4.1006 3.6255 5.1823 3.5502 4.6094 1.1920 1.1617 1.3444 4.9967 1.6302 1.6019 1.8850 2.3949 2.3021 2.1493 1.3556 1.4546 1.3594 1.4519 1.4428 3.7777 2.9234 2.6883 2.9105 2.1899 1.8098 1.6735 1.3219 1.5951 1.6704 1.9407 1.8029 1.2499 2.2228 1.5705 1.4055 1.5947 1.2117 1.3511 1.8357 2.0288 1.2810 1.3367 2.6958 4.0998 1.2187 1.2543 2.0043 2.2942 4.4218 3.7492 1.0504 1.0447 1.0751 1.0511 2.6213 1.0923 1.2188 2.6872 7.1645 7.2741 5.8207 6.4456 6.5169 8.2071 1.0860 1.0356 1.0356 1.0604 1.0609 1.1025 1.1021 1.0997 1.0997 1.1010 1.1008 1.0893 1.0891 1.0874 1.0881 1.0932 1.0961 1.0951 1.0964 1.0641
irintensity: 0.4771 0.4301 0.2172 0.5160 0.0826 0.4075 0.6305 0.3752 0.1476 1.5705 0.8886 0.0815 1.6323 0.5936 2.1090 1.8648 1.6097 2.6597 11.1272 7.9752 15.5626 12.7924 1.1632 4.8136 2.6288 14.1061 4.9379 13.1341 39.5691 19.5666 8.3519 66.3821 60.4555 0.8515 1.0973 18.9276 72.0094 8.0572 6.6713 10.9861 12.4327 7.4198 14.8706 6.5382 34.5546 26.1971 26.3334 55.5177 0.1205 3.0244 15.2757 62.2364 1.7808 46.4574 31.5667 208.7076 15.2206 236.7716 14.5240 13.3761 57.1459 18.5411 9.9629 64.1017 437.2931 36.3747 65.5043 142.5495 48.5199 5.6859 45.4647 95.3286 3.2478 26.1247 197.3255 53.9724 12.2998 182.9642 2.8310 8.0537 0.0426 56.0873 103.5817 102.4399 7.6860 72.2851 10.0990 5.6547 2.0716 3.3944 20.2223 32.2518 65.1136 493.3894 310.7670 18.4880 1470.9977 30.5090 305.7869 307.6041 44.6766 33.7974 31.0924 49.6005 78.2758 5.2082 10.2326 39.7504 50.8294 8.0859 90.3964 10.8505 8.5663 4.2742 1.3075 25.1940 9.1416 25.7682 0.0809 60.8509
temp: 298.150 k
press: 1.00000 atm
elementType: 8 8 7 7 6 6 6 6 6 6 6 6 6 6 6 6 6 6 6 6 6 6 1 1 1 1 1 1 1 1 1 1 1 1 1 1 1 1 1 1 1 1
symmnumber: 1
zpe: 893943.3 jmol-1
zpe.correction: 0.340485 hartree
zpe.thermalcorrener: 0.361615 hartree
zpe.thermalcorrenthalpy: 0.362559 hartree
zpe.thermalcorrgfe: 0.288348 hartree
zpe.sumelectzpe: -956.278304 hartree
zpe.sumelectthermal: -956.257174 hartree
zpe.sumelectthermalent: -956.256230 hartree
zpe.sumelectthermalfe: -956.330441 hartree
dipole: -9.3925 -1.9165 1.1401
dipole: 9.6536
quadrupole: -112.7177 -121.6310 -133.8162
quadrupole: -11.3595 7.7913 -2.6050
quadrupole: 10.0039 1.0906 -11.0946 -11.3595 7.7913 -2.6050
hfenergy: -956.6187891 hartree
pointgroup: C01 [X(C18H20N2O2)]
dipole: 3.6850092 0.008093 -0.9195143 debye
polarizability: 597.4370045|-6.839904|124.0993051|-11.8586855|8.0920676|191.0895708 unknown
InChI: InChI=1S/C18H20N2O2/c1-3-20(4-2)17-11-5-14(6-12-17)13-19-16-9-7-15(8-10-16)18(21)22/h5-13,21H,3-4H2,1-2H3
charge 0 multiplicity 1
42 atoms
O  -7.327037 0.618065 -1.191255
O  -7.641085 -0.093488 0.996893
N  5.401568 0.010994 -0.005578
N  -1.134199 0.056925 0.545102
C  4.012698 -0.074816 -0.100403
C  6.282148 -0.341383 -1.139643
C  6.071808 0.463158 1.233008
C  3.372226 -0.61578 -1.266228
C  3.160739 0.376408 0.968968
C  6.640003 -1.844836 -1.201528
C  6.218532 1.999658 1.33039
C  1.136913 -0.242077 -0.290547
C  1.97527 -0.690196 -1.350293
C  1.769208 0.289961 0.871989
C  -0.313215 -0.326418 -0.411751
C  -2.53039 0.082155 0.36201
C  -3.359077 -0.248833 1.475918
C  -3.153002 0.491296 -0.859353
C  -5.369246 0.174961 0.137992
C  -4.755839 -0.214751 1.361795
C  -4.552806 0.535552 -0.967378
C  -6.845526 0.205351 0.069461
H  5.811128 -0.018717 -2.086214
H  7.209532 0.253513 -1.040957
H  5.527061 0.071994 2.111517
H  7.073845 -0.004554 1.261175
H  3.968584 -0.993401 -2.10084
H  3.595737 0.810167 1.873562
H  7.155885 -2.164594 -0.278175
H  5.735238 -2.466731 -1.315064
H  7.311163 -2.047239 -2.05669
H  6.806585 2.393045 0.481581
H  5.23277 2.495988 1.3172
H  6.73685 2.279896 2.266008
H  1.517422 -1.112667 -2.254336
H  1.130259 0.638648 1.690241
H  -0.694746 -0.759974 -1.361951
H  -2.872767 -0.533944 2.413787
H  -2.528489 0.804401 -1.703828
H  -5.39854 -0.47861 2.208081
H  -5.030785 0.852908 -1.898624
H  -8.320827 0.610365 -1.158244
