program: Gaussian 09
title: 000238021
version: EM64L-G09RevD.01
frameworkgroup: C1[X(C2H12Cl2N7P3)]
method: RPBEPBE
basis: SDD
operation: Freq
keyword: #p
keyword: freq=noraman
keyword: PBEPBE/SDD
title: #p freq=noraman PBEPBE/SDD
converged: YES YES NO NO
title: Mulliken charges:
elementType: Cl Cl P P P N N N N N N N C C H H H H H H H H H H H H
charge: -0.176244 -0.143150 1.246614 1.297723 0.703695 -0.812158 -0.653561 -0.667488 -0.688034 -0.707701 -0.907757 -0.893032 -0.584087 -0.579944 0.336855 0.347867 0.349887 0.365654 0.348725 0.353713 0.231821 0.221505 0.280691 0.232896 0.265776 0.229735
chargesum: 0.00000
title: Mulliken charges with hydrogens summed into heavy atoms:
elementType: Cl Cl P P P N N N N N N N C C
charge: -0.176244 -0.143150 1.246614 1.297723 0.703695 -0.812158 -0.316706 -0.319621 -0.688034 -0.707701 -0.192216 -0.190595 0.149930 0.148463
polarizability: 1.99430361e+02 4.46075449e+00 1.66869300e+02 7.68156305e+00 2.52662652e+00 1.58914087e+02
1716.lowfreq: -18.0215 -9.1098 -5.8666 -0.0023 -0.0012 -0.0008 20.3141 29.9454 40.0233
frequency: 14.2149 29.4253 39.9907 74.7552 85.1265 108.6019 130.5241 133.2855 142.0301 149.7508 163.8825 178.6867 191.2272 213.1843 221.3770 232.5117 236.8031 249.4634 280.7657 303.5072 320.3976 338.2846 377.4117 380.7238 402.2698 418.0984 444.3946 465.1604 482.0104 485.9086 508.3308 516.7526 560.9446 590.8176 651.4608 778.9323 799.7935 847.4704 872.9205 911.4775 951.0026 986.2237 993.8857 1020.7950 1097.6713 1102.2536 1112.7061 1120.6817 1122.4754 1131.7571 1377.0280 1391.9740 1425.5977 1434.2291 1479.3951 1480.7067 1488.8751 1491.4221 1544.7476 1560.6153 2962.1774 2967.5827 3056.3602 3059.2527 3096.5909 3103.1965 3540.9152 3544.6841 3546.6759 3548.0656 3693.0048 3700.8986
redmass: 7.5528 5.8152 4.0326 2.9596 3.9332 4.5077 9.5682 2.1203 2.7146 1.4702 1.9042 4.3287 4.0184 5.2580 3.4544 3.6383 5.1477 3.1383 1.6528 3.9187 6.3049 4.0031 5.2145 4.5858 2.0201 10.9846 1.4817 1.5549 1.9725 6.9966 1.5389 3.1102 1.4692 5.3283 7.9870 4.4039 4.0972 4.5197 4.2877 10.2064 8.1656 1.6830 1.8689 4.4875 2.9435 1.5170 1.4694 1.3111 1.3447 3.6634 1.3059 1.2989 1.1235 1.1253 1.0498 1.0462 1.0451 1.0446 1.1087 1.1021 1.0396 1.0384 1.0956 1.0973 1.1003 1.0995 1.0444 1.0440 1.0756 1.0756 1.1027 1.1039
irintensity: 0.1446 0.2914 1.7043 2.4266 1.5872 0.9984 2.4607 0.1968 1.2478 1.0694 0.8665 0.9403 3.5631 2.3812 2.4685 6.3872 1.7770 2.6208 4.9470 14.5619 29.4915 12.5273 63.2187 50.0009 70.9724 92.9007 233.6119 28.0564 39.1101 5.9045 305.0970 197.1230 109.8541 4.9534 69.8893 90.2863 102.4741 52.7044 107.2942 32.1099 512.2761 217.5981 39.9657 715.2841 153.8011 11.3204 4.6449 6.1108 6.5269 12.7702 37.1797 13.3944 7.8689 4.5391 11.1527 16.9638 15.2320 13.2948 84.2385 66.9773 86.5949 66.0221 30.6988 30.0027 9.1086 10.1498 64.7262 56.6115 28.3580 52.2005 37.3884 41.4133
temp: 298.150 k
press: 1.00000 atm
elementType: 17 17 15 15 15 7 7 7 7 7 7 7 6 6 1 1 1 1 1 1 1 1 1 1 1 1
symmnumber: 1
zpe: 475313.0 jmol-1
zpe.correction: 0.181037 hartree
zpe.thermalcorrener: 0.201284 hartree
zpe.thermalcorrenthalpy: 0.202229 hartree
zpe.thermalcorrgfe: 0.130760 hartree
zpe.sumelectzpe: -2409.287606 hartree
zpe.sumelectthermal: -2409.267359 hartree
zpe.sumelectthermalent: -2409.266414 hartree
zpe.sumelectthermalfe: -2409.337883 hartree
dipole: 7.1749 1.6749 -1.8387
dipole: 7.5937
quadrupole: -129.4241 -105.5644 -110.0116
quadrupole: -4.1807 5.7081 0.5011
quadrupole: -14.4241 9.4356 4.9884 -4.1807 5.7081 0.5011
hfenergy: -2409.4686431 hartree
pointgroup: C01 [X(C2H12Cl2N7P3)]
dipole: 2.2592297 -1.4534554 1.3073472 debye
dipolederiv: -0.7353191 0.366665 0.1228802 0.4451484 -0.7031247 -0.1745062 0.2689659 -0.2541488 -0.4107178 -0.4412429 0.0382952 -0.312612 0.0054619 -0.252759 0.0146208 -0.4054743 0.0537688 -0.9119033 2.5720085 0.3347839 0.0229941 0.3679461 1.72016 0.0669871 0.2955318 0.2474365 1.5858347 1.5725203 0.1072541 0.0352327 0.1116421 2.5874852 -0.5279792 -0.2060118 -0.6505753 1.8770389 1.9752113 -0.387725 0.3971983 -0.4062185 1.67012 -0.0979121 0.3357725 -0.1488162 1.7126893 -1.161044 -0.4668441 0.0419652 -0.4025938 -1.2938302 0.2134438 0.0918592 0.2179361 -0.8291325 -0.7123154 -0.1639207 0.0582444 -0.2100932 -0.86442 -0.2142548 0.008343 -0.2054192 -0.8163428 -1.0000311 0.0422289 0.1253706 0.035002 -0.575694 -0.1689779 0.0504007 -0.1400561 -0.8194508 -1.7475594 0.081027 -0.2718094 -0.0112112 -0.6509529 0.033461 -0.3599123 0.0707249 -0.6068125 -0.7706627 0.2612508 -0.2361328 0.2802182 -1.4206302 0.5153038 -0.1748894 0.5777749 -0.821671 -0.741241 -0.286684 0.079785 -0.2980655 -0.8745989 0.1401831 0.1241943 0.2100306 -1.0632648 -0.5869857 0.0618881 -0.1712477 0.07489 -1.2910746 0.0554346 -0.1481336 0.0454777 -0.7547155 0.0828578 -0.2076721 -0.3179721 0.0323839 0.3167502 0.1157907 -0.0934468 0.103302 0.3187543 0.1517133 -0.0278593 0.082408 -0.3115995 0.2473241 0.2797355 -0.0825945 0.1146285 0.3776756 0.1819731 0.118934 -0.0043833 0.0824891 0.1692831 -0.0892487 -0.0968256 -0.0946219 0.181184 0.2666174 0.0083847 0.0764921 0.0826446 0.0909104 -0.0597992 0.1202777 0.0007955 0.2192618 0.2405699 0.0967758 0.0471206 0.1150135 0.3002923 -0.0063224 0.0189122 0.0711602 0.1653078 0.288533 0.1109887 -0.0013803 0.089023 0.2092524 0.0571683 0.0150779 -0.0174789 0.2186791 0.24184 -0.0747799 0.0913383 -0.0375385 0.2519395 -0.0561205 0.0884727 0.0238646 0.2197663 0.1930655 -0.0062732 0.0780269 -0.0491156 0.2230179 -0.0541773 0.0622939 -0.1208012 0.2972863 0.0315541 -0.1070428 -0.0120655 -0.0990527 -0.1163347 -0.1081181 -0.0056806 -0.1080963 0.0453508 0.0516337 0.0451439 0.14745 -0.0252861 0.0042042 0.0858085 0.0741738 -0.0127043 -0.1596168 0.010118 0.0799088 -0.0093459 0.0420315 0.1521585 0.0294174 -0.038238 0.0549369 0.0436945 0.0679582 0.0149791 -0.1206355 0.072755 0.0417989 -0.027152 0.0156835 -0.0596699 -0.1883889 0.1540667 -0.0926289 -0.0168079 -0.0426563 -0.0242577 0.0278676 -0.01877 0.0781854 0.0708586 -0.1858395 0.0529223 0.067886 0.0567815 0.08298 -0.0506538 0.060018 -0.0576344 0.0486348 unknown
polarizability: 192.6273439|-15.2350566|175.3533581|0.882311|0.0224535|157.2330471 unknown
InChI: InChI=1S/C2H12N7P3.2Cl/c1-5-12(6-2)8-10-7-11(3,4)9-12;;/h5-6H,3-4H2,1-2H3;;
charge 0 multiplicity 1
26 atoms
Cl -2.827801 2.148357 0.244588
Cl -2.386448 0.613873 -2.769162
P  1.422225 0.414255 -0.038751
P  -0.458078 -1.808314 0.699373
P  -1.452844 0.584123 -0.71843
N  1.117683 -1.193866 0.465507
N  1.973728 1.578921 1.109019
N  2.839832 0.286072 -0.997687
N  0.094801 1.226405 -0.843807
N  -1.787334 -0.885421 0.029662
N  -1.030329 -2.053149 2.294663
N  -0.323582 -3.419657 0.146841
C  1.070727 2.483769 1.841448
C  3.137411 -0.868738 -1.860108
H  2.888924 1.383441 1.521877
H  3.256577 1.185294 -1.252201
H  -0.580818 -2.715149 2.923848
H  -1.750441 -1.431576 2.658135
H  0.34504 -3.642056 -0.588293
H  -1.079445 -4.079255 0.326024
H  1.613187 3.411762 2.092222
H  0.671742 2.03963 2.775525
H  0.225848 2.755287 1.186266
H  2.681073 -0.786658 -2.86658
H  2.759324 -1.777423 -1.364191
H  4.231696 -0.965926 -1.970089
