program: Gaussian 09
title: 000238018
version: EM64L-G09RevD.01
frameworkgroup: C1[X(C11H10Br2N4)]
method: RPBEPBE
basis: SDD
operation: Freq
keyword: #p
keyword: freq=noraman
keyword: PBEPBE/SDD
title: #p freq=noraman PBEPBE/SDD
converged: YES YES NO NO
title: Mulliken charges:
elementType: Br Br N N N N C C C C C C C C C C C H H H H H H H H H H
charge: -0.010282 0.000377 -0.457797 -0.138179 -0.107249 -0.588652 0.400451 0.448693 -0.485673 0.309701 -0.444584 -0.310956 -0.029438 -0.778183 -0.154954 -0.171019 -0.238565 0.303739 0.229671 0.311730 0.248516 0.256936 0.248476 0.249483 0.244563 0.327443 0.335750
chargesum: 0.00000
title: Mulliken charges with hydrogens summed into heavy atoms:
elementType: Br Br N N N N C C C C C C C C C C C
charge: -0.010282 0.000377 -0.154058 -0.138179 -0.107249 0.074542 0.400451 0.448693 -0.485673 0.309701 -0.214913 0.000774 -0.029438 -0.024255 0.094529 0.073544 -0.238565
polarizability: 3.24605923e+02 7.55995731e+00 2.12917944e+02 7.86520141e-02 3.79599403e-01 6.94267908e+01
1716.lowfreq: -3.8404 -1.4284 -0.0002 -0.0001 0.0001 4.5975 29.4683 38.2906 60.2269
frequency: 29.4602 38.2726 60.2268 61.5765 116.1177 123.7195 130.4211 179.1188 200.7995 221.3271 223.4732 259.5772 283.6532 300.1308 324.8387 326.2135 374.9248 411.1970 465.0613 499.2884 506.8069 522.1329 531.7363 575.1707 613.5118 621.1042 649.5214 655.4678 698.4981 708.1447 716.2655 772.9561 815.4631 817.4002 844.5634 925.8448 943.9465 944.4656 984.8554 989.3452 1021.6179 1044.4707 1061.2848 1072.2383 1096.7953 1126.1569 1184.7733 1257.2306 1264.8546 1293.7705 1339.6106 1370.5736 1392.1941 1396.7867 1403.7362 1456.3998 1462.7504 1469.6072 1484.1127 1493.6051 1529.0611 1558.7618 1598.4666 1605.4795 1615.8247 2991.7912 3070.8845 3117.9273 3127.0481 3160.3048 3172.7764 3199.9892 3484.0167 3565.0482 3722.8765
redmass: 5.7792 4.2626 9.7368 5.4645 5.9555 17.6700 1.0755 8.0445 3.7457 6.9704 5.6460 8.7935 9.2197 3.2092 5.5884 5.0300 5.7669 3.0076 1.2011 3.5523 2.6441 1.1133 6.4698 3.0870 8.0398 6.8260 6.3923 1.5508 4.1510 3.2023 6.2457 9.3577 5.0434 1.4223 1.4216 3.8360 1.3661 3.2576 1.3211 4.9932 2.9582 1.5642 2.4302 2.3452 1.9938 1.8239 1.1100 2.8634 4.4700 1.4302 3.7927 3.5126 1.8597 2.2594 3.8458 1.4052 1.0454 2.2147 2.6367 4.5228 6.1395 3.6613 2.3798 5.4026 1.8420 1.0379 1.0969 1.0904 1.0991 1.0914 1.0948 1.0944 1.0754 1.0443 1.1058
irintensity: 0.1310 0.1169 0.0788 0.1159 0.9555 0.4188 0.5863 1.2622 8.3967 2.1406 1.8766 4.1830 0.5532 5.8685 0.5250 3.0357 21.7223 0.1852 272.7831 0.5576 53.2385 9.7413 7.6994 0.8219 4.4127 2.5415 10.8619 31.9272 12.1334 0.6157 9.4848 32.2644 11.5698 39.2735 64.2422 17.9046 1.4243 14.5192 2.7832 47.5233 30.0632 6.3432 27.9105 7.2953 12.8802 2.0701 5.7871 33.5270 36.7921 4.1885 2.3485 0.3338 23.2945 52.3273 32.6402 61.9630 16.6742 267.7462 135.8370 161.6991 712.9695 471.7807 291.1505 3.7638 486.7703 9.0763 11.4987 14.6382 10.2629 3.7902 4.1565 16.3804 48.2371 118.3102 46.8431
temp: 298.150 k
press: 1.00000 atm
elementType: 35 35 7 7 7 7 6 6 6 6 6 6 6 6 6 6 6 1 1 1 1 1 1 1 1 1 1
symmnumber: 1
zpe: 512476.8 jmol-1
zpe.correction: 0.195192 hartree
zpe.thermalcorrener: 0.211417 hartree
zpe.thermalcorrenthalpy: 0.212361 hartree
zpe.thermalcorrgfe: 0.148719 hartree
zpe.sumelectzpe: -669.917287 hartree
zpe.sumelectthermal: -669.901062 hartree
zpe.sumelectthermalent: -669.900118 hartree
zpe.sumelectthermalfe: -669.963761 hartree
dipole: 2.1043 0.6915 -0.0257
dipole: 2.2152
quadrupole: -127.0762 -96.5568 -123.6075
quadrupole: 1.6677 0.0074 0.0548
quadrupole: -11.3293 19.1900 -7.8607 1.6677 0.0074 0.0548
hfenergy: -670.1124795 hartree
pointgroup: C01 [X(C11H10Br2N4)]
dipole: 0.8625416 -0.107021 0.0639902 debye
polarizability: 323.1336908|14.5378936|210.7721644|8.4431301|-21.1735447|73.0448033 unknown
InChI: InChI=1S/C11H10Br2N4/c1-6-9(13)10(17-11(14)15-6)16-8-4-2-7(12)3-5-8/h2-5,16H,14H2,1H3
charge 0 multiplicity 1
27 atoms
Br 2.283519 2.959778 -0.388556
Br -6.113352 -0.752488 -0.168318
N  -0.147443 0.958649 -0.159776
N  1.072625 -1.05984 0.205358
N  3.523411 -1.030972 0.294325
N  2.312705 -3.010046 0.56311
C  1.055056 0.288329 -0.008749
C  -1.486432 0.492245 -0.147086
C  2.294459 1.012242 -0.077107
C  3.516689 0.324658 0.078013
C  -2.502324 1.472938 -0.329302
C  -1.862324 -0.866595 0.030325
C  2.300525 -1.652408 0.346845
C  4.861625 1.005964 0.01902
C  -3.863501 1.113673 -0.336496
C  -3.226992 -1.227126 0.022958
C  -4.215688 -0.240585 -0.159659
H  -0.041625 1.966771 -0.310546
H  -2.229755 2.52704 -0.466986
H  -1.082936 -1.615388 0.170695
H  4.950787 1.783705 0.799447
H  5.649045 0.252059 0.165655
H  5.013233 1.508235 -0.953902
H  -4.633049 1.877586 -0.477521
H  -3.510488 -2.274946 0.159478
H  1.436579 -3.52098 0.616954
H  3.207255 -3.478997 0.674722
