program: Gaussian 09
title: 000238017
version: EM64L-G09RevD.01
frameworkgroup: C1[X(C11H11BrN4)]
method: RPBEPBE
basis: SDD
operation: Freq
keyword: #p
keyword: freq=noraman
keyword: PBEPBE/SDD
title: #p freq=noraman PBEPBE/SDD
converged: YES YES NO NO
title: Mulliken charges:
elementType: Br N N N N C C C C C C C C C C C H H H H H H H H H H H
charge: -0.005396 -0.467203 -0.138209 -0.108451 -0.588486 0.448709 0.298466 -0.497914 0.277488 -0.452996 -0.314631 -0.155190 -0.172264 -0.040340 -0.777117 -0.237915 0.306396 0.223238 0.224453 0.315289 0.248006 0.243895 0.229508 0.254269 0.230187 0.324212 0.331997
chargesum: 0.00000
title: Mulliken charges with hydrogens summed into heavy atoms:
elementType: Br N N N N C C C C C C C C C C C
charge: -0.005396 -0.160808 -0.138209 -0.108451 0.067723 0.448709 0.298466 -0.274676 0.277488 -0.228544 0.000658 0.092816 0.071631 -0.040340 -0.063154 -0.237915
polarizability: 3.12531743e+02 -3.14584876e+00 1.71985233e+02 5.58891992e-03 9.87546675e-03 6.62504559e+01
1716.lowfreq: -75.7772 -3.4790 -0.0003 0.0002 0.0004 3.3040 5.2416 30.7876 44.4446
frequency: -75.7761 30.5917 44.2395 69.9972 103.6132 176.8746 183.0586 189.9795 201.0038 223.4758 290.4229 300.9386 316.5095 371.5787 412.7148 450.4160 457.1020 504.3984 525.4154 532.8392 574.2547 583.1081 616.1217 620.3962 637.8446 675.1521 706.2066 714.8084 774.6521 813.1779 813.3898 827.3619 846.9695 920.8828 928.2300 939.9441 987.9917 988.8736 994.7155 1047.0016 1060.9485 1064.2574 1092.6900 1120.9379 1183.6482 1186.4933 1260.8639 1276.5618 1294.4639 1333.6977 1383.4427 1392.1516 1402.7962 1413.4427 1459.5605 1469.2694 1471.3812 1489.1149 1502.3668 1557.1111 1563.9056 1597.4622 1605.5556 1614.2045 2987.8502 3068.1789 3116.8339 3119.9869 3147.1859 3161.8800 3169.1997 3193.2739 3539.2966 3563.6889 3723.3457
redmass: 1.0282 5.5981 4.0828 7.0998 6.1487 4.6708 6.2350 8.9820 3.9038 6.6016 2.9589 4.3836 4.9676 6.1811 3.0214 1.2124 3.0415 2.5186 1.1068 5.7443 2.2308 6.9995 1.5032 6.7693 6.3215 4.2288 3.3672 5.9745 4.5336 4.9391 1.4730 1.6939 1.3979 8.4166 2.2848 1.3577 4.5595 1.3115 2.0688 1.5864 2.4398 2.7828 2.1732 1.5734 1.2094 1.3517 2.3008 4.3265 1.5499 3.2606 1.8049 2.3668 3.8670 2.7299 1.4531 1.0479 2.2125 2.2798 3.8644 6.1330 4.0258 2.1903 4.2862 2.3127 1.0380 1.0974 1.0900 1.0984 1.0929 1.0910 1.0950 1.0951 1.0755 1.0441 1.1058
irintensity: 0.4182 0.0443 0.1249 0.1651 0.0153 5.2832 0.2188 0.9250 10.7702 2.3808 1.3696 9.5030 0.0586 17.7733 0.3246 273.1204 0.1132 55.5691 6.6711 5.7283 0.1573 0.9678 55.6100 3.7136 12.3760 1.8728 0.3597 3.9139 3.0550 11.0132 36.6360 68.3987 54.9562 8.3714 8.2092 1.2181 41.8419 3.1670 0.9276 9.1969 31.7029 0.8872 2.6951 7.8063 4.7079 12.4831 53.0486 28.7013 4.9853 2.5106 76.2183 29.7404 70.3431 8.1097 64.3395 17.3092 319.4659 105.4365 406.3394 1022.9076 100.7425 138.6672 37.7967 364.0228 18.7880 18.2092 16.9782 11.2685 7.0533 4.5809 4.7343 20.1868 18.6986 98.5500 44.1401
temp: 298.150 k
press: 1.00000 atm
elementType: 35 7 7 7 7 6 6 6 6 6 6 6 6 6 6 6 1 1 1 1 1 1 1 1 1 1 1
symmnumber: 1
zpe: 538219.7 jmol-1
zpe.correction: 0.204997 hartree
zpe.thermalcorrener: 0.219006 hartree
zpe.thermalcorrenthalpy: 0.219950 hartree
zpe.thermalcorrgfe: 0.162341 hartree
zpe.sumelectzpe: -657.128764 hartree
zpe.sumelectthermal: -657.114756 hartree
zpe.sumelectthermalent: -657.113811 hartree
zpe.sumelectthermalfe: -657.171420 hartree
dipole: 2.6235 -1.5408 0.0258
dipole: 3.0426
quadrupole: -110.8043 -79.3334 -109.2282
quadrupole: -1.2078 0.0812 0.0735
quadrupole: -11.0157 20.4552 -9.4396 -1.2078 0.0812 0.0735
hfenergy: -657.3337615 hartree
pointgroup: C01 [X(C11H11Br1N4)]
dipole: 0.9792252 0.6872262 -0.0424164 debye
polarizability: 310.7017841|14.4027403|173.3766294|-10.1301425|0.8154293|66.6890185 unknown
InChI: InChI=1S/C11H11BrN4/c1-7-6-10(16-11(13)14-7)15-9-4-2-8(12)3-5-9/h2-6,15H,13H2,1H3
charge 0 multiplicity 1
27 atoms
Br -5.933014 -0.909423 0.225262
N  -0.08072 1.149077 -0.00245
N  1.263396 -0.826945 -0.082541
N  3.712676 -0.63464 -0.179158
N  2.645373 -2.713449 -0.162685
C  -1.389719 0.610762 0.047248
C  1.171399 0.534534 -0.059321
C  2.334038 1.364046 -0.093054
C  3.593398 0.731425 -0.154357
C  -2.466794 1.540797 0.106112
C  -1.681428 -0.780976 0.040622
C  -3.803704 1.101327 0.157885
C  -3.020886 -1.221357 0.093058
C  2.535382 -1.342555 -0.139995
C  4.879993 1.52656 -0.197309
C  -4.070074 -0.283294 0.151345
H  -0.040345 2.17013 0.007326
H  2.256987 2.455432 -0.072426
H  -2.262576 2.619176 0.111479
H  -0.853878 -1.489301 -0.005801
H  -4.620225 1.827348 0.202846
H  -3.237846 -2.293633 0.088344
H  4.976156 2.178172 0.690574
H  5.73736 0.837161 -0.226856
H  4.915762 2.177623 -1.090207
H  1.807224 -3.286687 -0.142787
H  3.572464 -3.126509 -0.211557
