program: Gaussian 09
title: 000238015
version: EM64L-G09RevD.01
frameworkgroup: C1[X(C10H9Cl2N5)]
method: RPBEPBE
basis: SDD
operation: Freq
keyword: #p
keyword: freq=noraman
keyword: PBEPBE/SDD
title: #p freq=noraman PBEPBE/SDD
converged: YES YES NO NO
title: Mulliken charges:
elementType: Cl Cl N N N N N C C C C C C C C C C H H H H H H H H H
charge: -0.026002 -0.021832 -0.475790 -0.168005 -0.130189 -0.638294 -0.591384 0.479913 0.339069 -0.472549 -0.327768 -0.538477 -0.024796 -0.190759 0.276783 -0.123039 -0.003435 0.306594 0.248300 0.320274 0.215677 0.251139 0.329327 0.313380 0.328659 0.323203
chargesum: 0.00000
title: Mulliken charges with hydrogens summed into heavy atoms:
elementType: Cl Cl N N N N N C C C C C C C C C C
charge: -0.026002 -0.021832 -0.169197 -0.168005 -0.130189 0.004413 0.060479 0.479913 0.339069 -0.224249 -0.007494 -0.322800 -0.024796 0.060380 0.276783 -0.123039 -0.003435
polarizability: 3.09596848e+02 9.96477666e+00 1.82573612e+02 -6.16287261e-02 1.00867935e-03 6.24968036e+01
1716.lowfreq: -4.8329 -2.4749 -0.0008 -0.0006 0.0008 3.7335 26.4785 35.9284 77.6291
frequency: 26.4659 35.8965 77.6282 105.9355 162.6074 171.1533 182.4912 190.4575 209.6112 224.2994 228.6762 318.7307 319.0971 341.3422 389.1708 423.6153 438.7541 439.4470 463.0282 483.4189 491.4504 523.9327 540.4859 557.3745 592.2466 600.8290 651.2042 664.0943 675.4165 675.5360 688.9927 737.8693 752.6241 802.7798 832.8639 854.9245 856.2612 919.1234 946.2056 981.7798 994.0048 1015.0046 1104.9052 1121.4930 1130.5723 1135.3635 1193.9430 1242.4791 1284.7462 1323.4082 1342.9168 1394.7063 1415.5879 1439.0054 1467.5128 1488.5431 1509.2500 1558.9739 1570.6992 1595.1088 1607.1222 1608.3641 1628.9919 3141.4000 3149.7411 3161.2619 3195.2859 3542.7391 3555.6045 3567.2420 3711.3832 3726.4958
redmass: 6.5667 7.6181 7.0559 6.6453 5.1475 17.0786 5.0975 10.5442 5.6494 7.6461 5.8531 5.2634 2.9547 7.6520 1.1838 7.7171 1.8133 1.6560 3.9946 5.1878 1.0756 1.0618 7.1087 2.1468 7.0044 1.9573 6.7982 3.9727 5.8166 3.9846 3.0297 6.0464 3.1324 3.0811 1.3304 1.6584 5.7621 8.3361 2.2662 1.3014 5.3225 2.0060 2.7695 2.2024 2.2809 1.4098 1.6508 1.3885 2.4224 4.2552 4.4795 6.4155 3.5980 3.7656 3.1187 2.4006 4.4410 5.4890 4.0804 1.7482 4.0117 1.9024 1.9093 1.0918 1.0928 1.0909 1.0952 1.0754 1.0449 1.0442 1.1046 1.1058
irintensity: 0.2914 0.0128 0.5276 0.1048 0.0014 0.3775 4.8571 1.4193 11.4548 0.7908 7.3165 0.4372 5.6804 7.8706 175.3920 5.2648 169.0682 109.3430 10.0015 23.6846 101.3298 41.8418 2.3764 55.5472 2.2310 25.0689 12.4205 1.7152 11.1254 8.9400 5.2659 0.7013 0.5788 97.1495 15.1573 73.6162 18.2212 1.8190 20.1021 3.8918 20.6395 2.0220 5.0256 55.6678 0.6745 16.4823 64.8492 32.0049 17.2179 95.0193 2.7233 6.7059 151.4722 1.1966 412.7518 93.2151 615.0629 302.1516 723.3549 184.6134 84.8418 864.6667 138.3453 5.4602 9.2621 2.1998 25.2185 15.7083 111.7103 92.6715 32.8346 43.1157
temp: 298.150 k
press: 1.00000 atm
elementType: 17 17 7 7 7 7 7 6 6 6 6 6 6 6 6 6 6 1 1 1 1 1 1 1 1 1
symmnumber: 1
zpe: 487488.3 jmol-1
zpe.correction: 0.185674 hartree
zpe.thermalcorrener: 0.201198 hartree
zpe.thermalcorrenthalpy: 0.202142 hartree
zpe.thermalcorrgfe: 0.141735 hartree
zpe.sumelectzpe: -1579.170111 hartree
zpe.sumelectthermal: -1579.154587 hartree
zpe.sumelectthermalent: -1579.153643 hartree
zpe.sumelectthermalfe: -1579.214051 hartree
dipole: -5.7573 -1.6626 -0.0060
dipole: 5.9926
quadrupole: -110.5942 -87.9839 -118.9655
quadrupole: 7.4223 -0.0314 -0.0626
quadrupole: -4.7463 17.8639 -13.1176 7.4223 -0.0314 -0.0626
hfenergy: -1579.355785 hartree
pointgroup: C01 [X(C10H9Cl2N5)]
dipole: 2.2607259 -0.6646634 0.0772893 debye
dipolederiv: -0.5504615 -0.2938053 -0.0051775 -0.4108467 -0.3435421 -0.0025628 -0.0023269 0.0004081 -0.0459202 -0.7872122 0.2679385 -0.027164 0.3509783 -0.2036175 0.0138852 -0.0294198 0.011784 -0.0379897 -2.6500414 0.0956455 -0.0601162 0.007616 -0.2372155 -0.0028493 -0.05602 0.0006249 -0.3526263 -1.2510707 -0.4905955 -0.0113442 -0.5499381 -1.0297002 0.0063763 -0.006959 0.0089299 -0.2363898 -0.8541008 0.3711463 -0.0231173 0.018283 -1.2657807 0.0242661 -0.0138483 0.0333159 -0.2828131 -1.4156451 0.6383123 -0.0328388 0.7507976 -0.5795131 0.0131382 -0.0348618 0.0105084 -0.7344682 -0.2863221 -0.2054197 0.0151438 -0.4585673 -1.4915754 0.0100755 0.0235699 0.0209735 -0.7306078 1.8180329 -0.2899681 0.0526524 -0.9078241 0.1998699 -0.0255155 0.0692024 -0.0103747 0.1191207 2.6371344 0.0146621 0.0568734 0.579003 0.8995635 -0.0021143 0.0367936 -0.0170916 0.2055186 -0.6974517 0.0294573 -0.0142501 -0.2114408 -0.0893553 -0.0079444 -0.0076649 -0.0014761 -0.1781945 -0.3932968 -0.0020052 -0.005154 0.4432758 -0.1103573 0.0095217 -0.018586 -0.0017562 -0.1763608 -1.7032578 0.2591468 -0.0391709 0.1014996 -0.3087652 0.0028228 -0.033764 0.0064247 -0.33534 0.7469565 0.4848875 0.0070322 0.5916695 0.5647648 -0.0007351 0.0052376 -0.0033631 -0.0183793 0.0657125 0.1550469 -0.0003512 -0.030008 0.0435623 -0.0041812 0.0051286 0.0005814 -0.0797217 2.1767425 -0.5992469 0.0613824 -0.273597 1.145158 -0.0288494 0.0506589 -0.0365649 0.2155921 0.6563657 -0.5782627 0.0358586 -0.5390549 0.0229715 -0.0174565 0.0337746 -0.0185138 -0.0903207 1.0985775 0.1963129 0.015742 0.560643 1.9902991 -0.0325081 0.0053348 -0.0430712 0.2010495 0.1324674 0.0119155 -0.004464 0.0163507 0.1102199 0.0056529 -0.0034726 0.0050394 0.2997122 0.0656466 0.0609333 -0.0046906 0.0521766 -0.0479133 0.0075585 -0.0047309 0.0075981 0.1746347 0.2571882 -0.0494284 0.0033396 -0.0691533 0.0595791 0.0013129 0.0039098 0.0018491 0.1688791 0.0533336 -0.0484978 -0.0025125 -0.0292972 -0.1161714 0.0068629 -0.0025573 0.0060696 0.2163986 0.0732403 0.0070867 -0.0024716 0.0305936 -0.0443118 0.0064531 -0.003055 0.0057563 0.1565266 0.2712767 -0.0305467 -0.0015004 -0.0109156 0.162612 0.0054451 -0.0012581 0.0047114 0.3830626 0.1961154 -0.0574226 -0.0026639 -0.1024996 0.1739766 0.0029367 -0.0017217 0.0040338 0.3878826 0.1930182 0.0622773 -0.0064779 0.0520931 0.2379285 0.0047302 -0.0074269 0.0030167 0.3894797 0.1470517 -0.0095698 -0.0045593 0.0381626 0.2573135 0.0036785 -0.005937 0.0005864 0.381275 unknown
polarizability: 309.3288971|-10.4859866|182.5877782|6.4746322|-3.4445959|62.7505882 unknown
InChI: InChI=1S/C10H9Cl2N5/c11-6-2-1-5(3-7(6)12)15-9-4-8(13)16-10(14)17-9/h1-4,15H,13-14H2
charge 0 multiplicity 1
26 atoms
Cl -4.972117 -1.828366 -0.04687
Cl -5.386863 1.447314 -0.149375
N  0.140958 -1.046218 0.069998
N  1.627889 0.826531 0.05573
N  4.054834 0.464604 0.11922
N  4.968785 -1.676217 0.192476
N  3.139209 2.609464 0.042877
C  -1.117456 -0.406795 0.018016
C  1.442045 -0.527412 0.084947
C  -2.265176 -1.250048 0.01066
C  -1.299375 1.003844 -0.026793
C  2.526792 -1.444953 0.131033
C  -3.554909 -0.694891 -0.040089
C  -2.60036 1.539532 -0.077606
C  3.834886 -0.89032 0.147446
C  -3.735343 0.702392 -0.084638
C  2.936243 1.248276 0.074098
H  0.101331 -2.066628 0.098491
H  -2.159598 -2.340197 0.043634
H  -0.417277 1.644074 -0.02047
H  2.36521 -2.526654 0.151532
H  -2.740906 2.624117 -0.111995
H  5.872331 -1.208521 0.199843
H  4.917776 -2.68987 0.216759
H  4.090568 2.965083 0.058906
H  2.338622 3.23336 0.012968
