program: Gaussian 09
title: 000226492
version: EM64L-G09RevD.01
frameworkgroup: C1[X(C21H25NO2)]
method: RPBEPBE
basis: SDD
operation: Freq
keyword: #p
keyword: freq=noraman
keyword: PBEPBE/SDD
title: #p freq=noraman PBEPBE/SDD
converged: NO YES NO NO
title: Mulliken charges:
elementType: O O N C C C C C C C C C C C C C C C C C C C C C H H H H H H H H H H H H H H H H H H H H H H H H H
charge: -0.274261 -0.237345 -0.186488 0.070856 -0.381218 -0.377357 -0.403841 -0.404657 -0.403297 0.396339 0.374032 0.146671 -0.373220 -0.373828 -0.348741 -0.342029 -0.259739 -0.249974 -0.251944 -0.254327 -0.248018 -0.246494 -0.231861 -0.673238 0.206673 0.250025 0.255739 0.191417 0.195850 0.202811 0.200792 0.193658 0.213482 0.191220 0.259040 0.242082 0.217640 0.245634 0.223305 0.222157 0.221411 0.223054 0.226518 0.226151 0.226025 0.227402 0.210375 0.232224 0.229291
chargesum: 0.00000
title: Mulliken charges with hydrogens summed into heavy atoms:
elementType: O O N C C C C C C C C C C C C C C C C C C C C C
charge: -0.274261 -0.237345 -0.186488 0.070856 0.075480 0.069800 -0.005179 -0.010207 0.001405 0.396339 0.374032 0.146671 -0.114179 -0.131746 -0.131101 -0.096394 -0.036434 -0.027817 -0.030533 -0.031273 -0.021500 -0.020343 0.221565 -0.001349
polarizability: 2.34120484e+02 9.99563097e+00 2.34004425e+02 -8.24689631e+00 6.66160170e+00 2.29650278e+02
1716.lowfreq: -13.8399 -3.7468 -0.0011 -0.0008 -0.0005 5.0516 21.0062 36.9180 54.2801
frequency: 20.7653 36.8039 54.1984 57.9660 64.0577 70.6004 84.0787 85.1998 102.3654 117.6807 170.4420 177.9137 198.5279 206.7666 249.6200 256.6440 257.4999 269.2593 278.9379 288.0794 314.6394 334.3633 356.0261 400.9416 403.9441 408.1236 418.5323 443.4514 460.9879 477.6417 524.1638 577.9293 616.1788 617.3177 638.2301 652.9862 696.2138 701.7774 710.4455 750.8567 758.3711 773.1360 797.2268 803.1820 804.6404 817.3876 842.7190 848.4541 857.1986 861.8435 889.6818 916.3525 925.4007 946.5070 950.9456 956.0838 976.5032 977.6477 984.0625 990.5200 992.6927 994.0604 1003.1928 1020.9348 1029.6312 1031.0178 1035.2236 1067.2640 1078.3492 1082.1945 1092.9114 1110.1803 1118.7576 1127.1984 1133.0986 1149.3560 1152.7543 1170.5419 1171.7802 1183.0347 1191.9263 1194.5098 1198.9156 1231.0081 1245.5089 1257.0003 1273.3484 1303.3515 1313.1659 1322.2956 1332.1148 1337.6587 1346.3159 1349.7835 1353.9299 1371.0362 1374.8702 1382.8201 1400.0596 1431.8439 1437.2174 1452.2231 1459.5048 1461.8794 1464.1811 1468.2464 1473.2748 1476.8405 1480.3030 1482.7583 1486.2479 1584.6231 1591.9174 1594.9721 1608.7551 1612.2646 2880.8629 2892.7700 2968.0155 2980.4429 2982.1763 2994.9767 3007.2292 3032.2165 3040.7102 3050.2839 3064.5564 3079.0283 3081.5090 3091.5544 3106.4702 3120.1339 3121.4395 3127.6488 3131.6303 3140.7419 3145.7524 3148.7106 3156.9436 3162.3813 3169.2293
redmass: 3.6426 3.1160 4.5377 4.0023 3.4741 3.9106 3.3922 2.5031 3.1657 6.0278 4.3049 3.0990 2.4713 2.8148 3.3371 4.5878 1.6016 3.5951 4.5817 3.6637 2.6884 4.2174 3.9881 2.9526 2.8393 2.8969 2.5261 2.9058 2.8234 3.3474 2.8001 2.8148 6.4266 6.3112 5.8662 5.2815 1.9143 4.2468 1.9070 1.8676 4.0247 2.5185 1.1061 2.6525 1.7917 3.8895 1.5371 1.2604 1.3840 2.2848 2.8885 1.4988 1.7955 2.9014 1.7376 2.3102 2.3301 1.6397 1.3724 5.8797 6.1026 1.3308 1.3260 2.4191 2.2155 2.1654 2.2989 2.1434 1.5653 1.5022 1.7256 2.3793 3.3770 3.7221 1.5129 2.3547 1.2236 1.0666 1.0574 1.6271 1.5163 1.1800 3.7048 2.6815 1.1395 1.2398 1.1705 1.4063 1.3620 1.3277 1.3074 1.3859 1.4348 1.3713 1.4144 1.3880 7.2288 7.0634 1.2603 2.2129 2.2751 1.0926 1.0864 1.0433 1.0932 1.0816 1.0621 2.1572 1.2707 1.7121 1.0737 7.2214 6.6224 7.9653 6.0942 6.1271 1.0713 1.0710 1.0623 1.0613 1.0616 1.0359 1.0581 1.0962 1.1023 1.1034 1.1064 1.0881 1.0900 1.0986 1.1023 1.0842 1.0845 1.0875 1.0883 1.0918 1.0933 1.0955 1.0967 1.1013 1.0982
irintensity: 0.3036 0.1907 0.1493 0.1624 0.2837 0.1449 1.2189 1.3504 0.1431 0.2063 0.4208 0.7889 2.3493 2.1096 0.7924 0.0476 1.9529 1.5850 3.4379 0.1284 9.6014 1.1707 9.5496 0.6277 1.0951 0.7343 8.3222 0.1904 1.2888 3.0670 7.0538 12.9696 0.0885 0.5550 14.5669 6.8463 25.1330 5.5274 70.2824 41.8822 36.8844 12.5911 3.8899 0.4511 0.2471 2.4642 7.2546 0.4564 3.2344 7.4176 3.0185 4.1794 38.7106 53.2767 11.6112 0.8548 38.5493 10.8808 0.5744 0.2136 1.7879 0.1223 0.1796 88.1051 9.0499 9.1443 5.0019 25.4660 15.5142 2.1384 15.6599 28.5561 15.5543 224.1361 22.2252 24.8246 2.6853 0.1831 0.7767 1.8053 5.4275 1.4806 33.6056 8.1131 0.1385 0.8962 6.4433 2.3084 3.1209 4.3623 1.9905 0.6237 3.5573 2.9747 0.3162 2.5916 0.2032 0.0912 24.2949 0.4940 21.7660 5.2028 12.8429 7.7592 20.2678 1.5522 4.7237 31.4801 2.8476 17.5620 15.1047 67.4678 22.7655 70.6055 8.1951 4.3330 51.8415 66.4097 41.2533 36.6042 33.3562 21.5410 22.1171 75.1077 29.6652 78.8456 8.7427 24.4955 9.6303 33.4265 38.5422 2.0358 0.5712 2.8230 11.7950 23.9970 14.4333 34.0042 35.3723 24.3817 11.3893
temp: 298.150 k
press: 1.00000 atm
elementType: 8 8 7 6 6 6 6 6 6 6 6 6 6 6 6 6 6 6 6 6 6 6 6 6 1 1 1 1 1 1 1 1 1 1 1 1 1 1 1 1 1 1 1 1 1 1 1 1 1
symmnumber: 1
zpe: 1076628.8 jmol-1
zpe.correction: 0.410066 hartree
zpe.thermalcorrener: 0.432485 hartree
zpe.thermalcorrenthalpy: 0.433429 hartree
zpe.thermalcorrgfe: 0.357817 hartree
zpe.sumelectzpe: -1018.652206 hartree
zpe.sumelectthermal: -1018.629787 hartree
zpe.sumelectthermalent: -1018.628843 hartree
zpe.sumelectthermalfe: -1018.704456 hartree
dipole: -1.8156 -0.3786 0.7774
dipole: 2.0110
quadrupole: -131.7938 -135.1237 -139.4101
quadrupole: 1.7383 3.7842 7.6649
quadrupole: 3.6487 0.3189 -3.9676 1.7383 3.7842 7.6649
hfenergy: -1019.0622725 hartree
pointgroup: C01 [X(C21H25N1O2)]
dipole: -0.7714356 0.0433414 0.1703023 debye
polarizability: 241.3933869|6.9282736|226.6847928|-3.168118|10.019239|229.6970073 unknown
InChI: InChI=1S/C21H25NO2/c1-2-24-20(23)21(18-12-6-3-7-13-18,19-14-8-4-9-15-19)22-16-10-5-11-17-22/h3-4,6-9,12-15H,2,5,10-11,16-17H2,1H3
charge 0 multiplicity 1
49 atoms
O  -1.931776 -0.206226 -1.649501
O  -0.080674 0.807658 -2.616542
N  -0.233241 1.328764 0.475764
C  0.06213 0.037577 -0.241684
C  0.435646 2.546594 -0.064417
C  -1.66644 1.608486 0.776404
C  0.404992 3.670369 0.993457
C  -1.768087 2.693061 1.869453
C  -1.044612 3.986291 1.428885
C  -0.466594 -1.179529 0.559662
C  1.595332 -0.178035 -0.350677
C  -0.59394 0.199249 -1.644073
C  -0.548293 -1.126187 1.972728
C  2.195792 -0.767252 -1.488956
C  -0.734076 -2.409456 -0.089208
C  2.407774 0.11069 0.775484
C  -0.91153 -2.268215 2.718813
C  3.579626 -1.054493 -1.502648
C  -1.092399 -3.554297 0.65374
C  3.789589 -0.169374 0.760695
C  -1.186942 -3.48967 2.063171
C  4.384268 -0.756951 -0.380539
C  -2.707987 0.121226 -2.886822
C  -4.133116 -0.368158 -2.651415
H  -0.067127 2.898274 -0.99718
H  1.474166 2.298646 -0.333208
H  -2.158929 0.678052 1.098536
H  -2.205585 1.96443 -0.135103
H  0.891102 4.57313 0.575947
H  0.996284 3.349907 1.873668
H  -1.311862 2.308308 2.802965
H  -2.835807 2.896878 2.080651
H  -1.051544 4.733535 2.245007
H  -1.591959 4.436748 0.574818
H  -0.320279 -0.182876 2.480475
H  1.597216 -0.98537 -2.377726
H  -0.665507 -2.477639 -1.18026
H  1.945578 0.563486 1.659313
H  -0.972699 -2.205499 3.811384
H  4.028399 -1.505968 -2.394779
H  -1.296762 -4.497113 0.133583
H  4.400683 0.064719 1.639913
H  -1.465501 -4.378542 2.640403
H  5.4572 -0.979473 -0.394204
H  -2.652012 1.211926 -3.056118
H  -2.22143 -0.381008 -3.742861
H  -4.753885 -0.15738 -3.541543
H  -4.150439 -1.455184 -2.463333
H  -4.585542 0.139789 -1.782521
