program: Gaussian 09
title: 000226490
version: EM64L-G09RevD.01
frameworkgroup: C1[X(C22H26O12)]
method: RPBEPBE
basis: SDD
operation: Freq
keyword: #p
keyword: freq=noraman
keyword: PBEPBE/SDD
title: #p freq=noraman PBEPBE/SDD
converged: NO YES NO NO
title: Mulliken charges:
elementType: O O O O O O O O O O O O C C C C C C C C C C C C C C C C C C C C C C H H H H H H H H H H H H H H H H H H H H H H H H H H
charge: -0.218537 -0.263880 -0.256368 -0.268366 -0.277183 -0.265787 -0.237606 -0.242348 -0.240416 -0.264786 -0.240287 -0.217290 -0.123696 -0.101853 -0.048071 -0.030857 -0.143919 -0.371452 0.312646 0.298655 0.304944 0.304487 0.225840 -0.765766 -0.761298 0.299841 -0.321050 -0.765968 -0.506249 -0.392684 0.417761 -0.759987 -0.217964 -0.538320 0.321357 0.277853 0.314008 0.307692 0.269322 0.274595 0.224390 0.265603 0.246813 0.247347 0.251486 0.247598 0.253688 0.257970 0.253657 0.250700 0.252709 0.289026 0.239850 0.264150 0.249309 0.239595 0.170426 0.229102 0.236588 0.242981
chargesum: 0.00000
title: Mulliken charges with hydrogens summed into heavy atoms:
elementType: O O O O O O O O O O O O C C C C C C C C C C C C C C C C C C C C C C
charge: -0.218537 -0.263880 -0.256368 -0.268366 -0.277183 -0.265787 -0.237606 -0.242348 -0.240416 -0.264786 -0.240287 -0.217290 0.197661 0.176000 0.265937 0.276835 0.125402 0.127534 0.312646 0.298655 0.304944 0.304487 0.225840 -0.006003 -0.008525 0.299841 -0.063080 -0.008902 -0.217223 -0.152834 0.417761 -0.006934 -0.047538 0.170350
polarizability: 3.56559363e+02 1.41057038e+00 2.26520256e+02 6.45100877e-01 -7.93537259e+00 2.65699189e+02
1716.lowfreq: -8.1277 -4.6987 -1.7537 -0.0008 0.0004 0.0004 10.0045 16.7189 17.9674
frequency: 8.5496 16.7104 17.9299 24.8015 26.1747 34.6067 37.3186 38.8650 42.9050 43.7962 48.8855 57.9536 59.1314 60.2312 67.4943 73.5332 76.7383 82.9847 85.7542 109.5341 115.5527 133.1637 138.3041 146.4636 165.3685 177.1418 183.5022 195.8300 197.6672 206.6778 220.1081 238.6476 257.6368 270.4302 280.9598 282.3456 295.9833 305.1177 338.4821 361.0568 377.6438 397.3697 411.2157 435.5413 447.7884 467.8113 479.7403 504.3999 510.3476 530.7484 545.1893 558.2907 561.4775 564.3875 571.5376 579.3569 607.0186 610.4905 623.4046 625.3693 638.5362 648.0256 667.9380 709.9612 744.9133 760.6538 772.4617 788.5419 805.0833 819.1926 828.3021 840.9525 869.7980 890.5104 905.3486 908.0081 920.4408 931.7085 945.1036 950.3987 964.5972 972.2878 987.5280 990.2665 995.6819 998.7863 1000.6354 1001.5943 1010.8915 1017.7814 1041.6894 1042.7590 1043.5518 1045.2633 1046.1561 1101.0325 1111.8784 1112.6909 1138.8713 1146.8279 1158.1442 1164.5798 1186.5628 1188.6545 1190.3944 1194.3009 1210.2465 1235.1667 1243.2576 1252.4068 1263.1525 1285.4326 1291.6573 1295.9328 1310.1670 1322.3366 1332.3358 1346.0667 1351.7352 1363.1924 1370.0470 1377.8539 1383.9952 1384.5561 1385.4580 1386.4967 1405.7455 1410.9685 1443.5236 1450.7474 1451.5701 1452.6418 1453.3632 1453.7857 1454.0957 1454.2974 1455.3228 1456.0572 1466.1461 1469.1790 1489.7597 1575.2863 1593.1122 1616.1857 1650.8033 1654.7561 1660.9404 1667.9317 2878.8674 2972.1647 3003.4863 3006.5439 3007.0745 3008.1998 3008.8315 3025.4888 3037.6328 3062.7718 3065.6367 3072.9581 3076.4561 3091.7739 3095.1816 3096.5250 3097.6064 3104.3412 3131.6322 3131.8899 3142.4205 3143.7113 3144.8201 3145.5978 3154.6492 3157.0495
redmass: 4.9180 6.5604 6.0004 6.5362 4.3263 1.5522 2.1969 1.3884 4.1696 2.6766 1.4470 3.0878 1.6094 4.9975 3.9554 3.4529 2.6165 4.4428 3.7997 4.0369 4.2888 5.5744 5.8359 5.1239 7.0700 4.6683 2.4695 6.2739 6.4884 3.5359 6.1170 5.8511 1.5609 4.1681 4.7367 5.8205 2.6149 5.8857 5.6456 4.3994 4.1897 3.6223 4.5223 3.7149 3.8606 4.1090 4.2405 4.8937 5.7716 4.7553 4.3930 3.4612 3.2824 3.2340 3.7886 4.8516 5.2783 4.3574 5.9446 4.9594 5.6194 5.2863 5.3650 5.9133 3.9807 3.9328 5.7607 4.4506 4.9686 1.8141 3.1922 5.2012 6.6513 1.3989 6.5719 4.6105 3.2504 5.5501 1.5534 3.3313 3.4795 3.0700 2.2144 1.8284 1.8897 2.6749 3.3162 2.8504 3.6352 3.3845 1.9767 1.6681 1.6741 1.6915 1.9967 2.4668 2.3340 1.2645 2.4716 1.4994 1.4992 1.8567 3.0525 3.2660 2.6540 2.5602 3.3229 2.4542 1.1874 2.5826 1.7175 1.2286 1.3709 1.2235 1.3498 1.4059 1.2451 1.4004 1.3375 1.8701 1.4128 1.4913 1.2483 1.2506 1.3509 1.2682 2.7118 2.7918 1.3956 1.0568 1.0470 1.0566 1.0641 1.0573 1.0706 1.0549 1.0501 1.0753 1.0867 1.0730 2.7231 8.4242 6.3894 6.7700 9.5989 9.5064 9.6609 9.2113 1.0852 1.0322 1.0375 1.0382 1.0368 1.0369 1.0850 1.0593 1.0835 1.0851 1.1044 1.0849 1.0874 1.0970 1.0974 1.0974 1.0948 1.1056 1.0927 1.0960 1.1005 1.1019 1.1008 1.1010 1.0940 1.0936
irintensity: 0.0881 0.5520 0.1573 0.3300 0.6186 1.4369 0.8441 1.9581 0.0642 0.2885 1.5477 0.5813 3.0194 1.2355 4.4706 3.8424 1.1010 1.0894 5.1963 10.0289 2.6167 0.9221 2.9354 8.9699 0.2518 0.8283 2.8679 3.1239 5.7799 8.4457 7.3757 8.3621 0.0516 4.2155 4.3060 3.3716 14.6782 2.2841 2.0971 7.2316 18.7570 16.6683 10.0350 2.3668 17.9991 6.5024 12.3800 10.1076 8.5538 9.4244 4.1230 2.0581 3.8658 2.3124 4.1793 10.7598 4.2847 4.9524 15.3439 35.2212 8.0804 9.3336 0.4696 33.9798 20.0795 10.4493 44.8945 16.0026 38.6814 17.3340 34.7145 80.5174 279.4100 19.8929 131.0123 12.8405 13.8304 11.0215 12.0156 35.3538 20.5764 20.8880 13.6030 6.9909 42.1305 126.2368 87.5880 108.2813 146.1270 85.4446 18.6562 5.9950 8.1554 4.9226 48.6669 50.9972 182.8710 0.9085 5.9856 20.2453 18.3456 44.1463 404.4570 273.2217 265.3936 170.5036 160.2741 40.0317 11.5676 222.4994 98.0573 15.4857 11.9549 4.5447 2.9938 2.5992 8.9525 4.3797 7.7764 26.8921 3.8396 1.1586 40.7885 65.9449 45.8848 53.4274 39.6848 63.6786 16.5432 33.4129 14.9023 6.9786 32.7386 42.1751 18.4405 11.9206 18.0200 5.9954 41.5837 34.4492 114.1361 152.3773 148.2471 89.9728 173.4336 134.3222 208.9380 174.5491 129.5031 47.8755 1.9488 1.7567 1.2567 0.9749 11.5462 29.0908 8.9826 4.1843 38.2957 9.8526 3.0626 5.8897 4.2228 4.7393 7.0421 5.3459 22.7288 3.2561 8.3762 9.0049 8.6866 9.1571 5.7235 3.9689
temp: 298.150 k
press: 1.00000 atm
elementType: 8 8 8 8 8 8 8 8 8 8 8 8 6 6 6 6 6 6 6 6 6 6 6 6 6 6 6 6 6 6 6 6 6 6 1 1 1 1 1 1 1 1 1 1 1 1 1 1 1 1 1 1 1 1 1 1 1 1 1 1
symmnumber: 1
zpe: 1193716.3 jmol-1
zpe.correction: 0.454663 hartree
zpe.thermalcorrener: 0.491727 hartree
zpe.thermalcorrenthalpy: 0.492671 hartree
zpe.thermalcorrgfe: 0.376874 hartree
zpe.sumelectzpe: -1754.045938 hartree
zpe.sumelectthermal: -1754.008874 hartree
zpe.sumelectthermalent: -1754.007930 hartree
zpe.sumelectthermalfe: -1754.123727 hartree
dipole: 1.7660 1.0070 -0.9420
dipole: 2.2406
quadrupole: -216.7465 -209.0585 -176.6242
quadrupole: 10.2722 16.7142 -5.2121
quadrupole: -15.9367 -8.2488 24.1855 10.2722 16.7142 -5.2121
hfenergy: -1754.5006006 hartree
pointgroup: C01 [X(C22H26O12)]
dipole: 0.65474 -0.4712308 0.3554015 debye
polarizability: 355.3517309|-12.5290539|228.5242119|-1.1572553|-9.6043705|264.9028655 unknown
InChI: InChI=1S/C22H26O12/c1-11(24)29-10-18-19(30-12(2)25)20(31-13(3)26)21(32-14(4)27)22(34-18)33-16-7-6-15(9-23)8-17(16)28-5/h6-9,18-22H,10H2,1-5H3
charge 0 multiplicity 1
60 atoms
O  0.229326 -0.762011 -0.776215
O  1.843907 0.894332 2.028259
O  2.756389 -2.046148 -0.03056
O  2.925819 0.620248 -1.509954
O  -0.34383 1.449497 0.004391
O  -1.453815 -2.784865 0.565326
O  3.29409 2.709621 1.832425
O  4.549093 -2.049018 1.461746
O  2.219842 2.444354 -2.781401
O  -2.054921 0.522353 1.871855
O  -1.557218 -3.978684 -1.447162
O  -6.828133 1.065658 -0.336674
C  2.450823 0.279455 0.819633
C  1.99107 -1.195345 0.917535
C  1.962651 1.015494 -0.447645
C  0.504983 -1.334273 0.569982
C  0.529828 0.63682 -0.88272
C  0.02949 -2.781544 0.515271
C  2.352156 2.145409 2.427824
C  4.059371 -2.395756 0.364036
C  -1.715736 1.451831 -0.31165
C  2.9769 1.459788 -2.639297
C  -2.630598 0.976645 0.683842
C  1.58681 2.648572 3.626575
C  4.734853 -3.201773 -0.718688
C  -2.134132 -3.377115 -0.518361
C  -2.191231 1.948747 -1.542116
C  4.046806 0.985878 -3.592903
C  -4.010911 0.989302 0.408352
C  -3.574981 1.965482 -1.810086
C  -4.485258 1.481242 -0.838495
C  -3.623532 -3.164142 -0.364664
C  -5.937836 1.487861 -1.125863
C  -2.96115 -0.057198 2.872018
H  3.549729 0.362639 0.87821
H  2.190955 -1.536781 1.950282
H  2.011154 2.108984 -0.312136
H  -0.07758 -0.759774 1.317077
H  0.352571 0.887651 -1.941249
H  0.368971 -3.278257 -0.408557
H  0.378892 -3.339057 1.401893
H  0.512826 2.707653 3.378315
H  1.963418 3.638353 3.920674
H  1.692716 1.944308 4.469995
H  5.047714 -2.523541 -1.533567
H  5.62384 -3.704156 -0.310653
H  4.038869 -3.937947 -1.152041
H  -1.472695 2.333553 -2.273734
H  5.03759 1.05027 -3.110041
H  4.038705 1.60824 -4.498842
H  3.876088 -0.071076 -3.86017
H  -4.75525 0.628266 1.125431
H  -3.948964 2.354694 -2.764177
H  -3.856825 -2.088095 -0.45604
H  -4.160555 -3.721351 -1.145353
H  -3.960186 -3.495098 0.632595
H  -6.214192 1.904265 -2.12756
H  -3.696378 0.690699 3.224806
H  -3.485745 -0.940868 2.463139
H  -2.30979 -0.362088 3.703585
