program: Gaussian 09
title: 000226484
version: EM64L-G09RevD.01
frameworkgroup: C1[X(C11H12O5)]
method: RPBEPBE
basis: SDD
operation: Freq
keyword: #pfreq=noraman
keyword: PBEPBE/SDD
title: #p freq=noraman PBEPBE/SDD
converged: YES YES NO NO
title: Mulliken charges:
elementType: O O O O O C C C C C C C C C C C H H H H H H H H H H H H
charge: -0.287828 -0.307962 -0.414474 -0.223248 -0.201252 0.526090 -0.456953 -0.646239 0.185044 -0.447375 0.261796 -0.294166 0.205035 -0.523787 0.250920 -0.749156 0.271985 0.262330 0.260917 0.235898 0.258125 0.222926 0.246838 0.231969 0.249938 0.249882 0.255652 0.377096
chargesum: 0.00000
title: Mulliken charges with hydrogens summed into heavy atoms:
elementType: O O O O O C C C C C C C C C C C
charge: -0.287828 -0.307962 -0.037378 -0.223248 -0.201252 0.526090 -0.184968 -0.122992 0.185044 -0.211477 0.261796 -0.036041 0.205035 0.177945 0.250920 0.006316
polarizability: 1.90198873e+02 8.82516606e+00 1.40348364e+02 -5.83723622e+00 1.34700215e+00 8.14397247e+01
1716.lowfreq: -7.6616 -1.3222 -0.0008 -0.0005 -0.0004 6.8775 9.9103 21.5158 32.3420
frequency: 9.8003 21.4596 32.3367 48.8222 63.0117 77.4979 88.0948 101.6450 143.5733 170.9563 200.2554 241.4967 266.7785 286.9889 318.4519 366.3350 368.1351 447.9596 464.1976 488.3402 525.6739 538.9288 564.9064 577.9114 623.8348 646.1852 662.8742 703.6293 735.5473 752.6312 814.2566 850.2930 866.7495 893.8131 897.4046 935.5071 947.9390 987.8444 994.4200 1039.7308 1045.2531 1096.5299 1110.9166 1153.2911 1158.5154 1165.3520 1177.8837 1191.2864 1240.9176 1251.2709 1276.8048 1344.4478 1377.6589 1382.5565 1404.0079 1438.7371 1445.4698 1452.8209 1454.2698 1459.4863 1480.3336 1486.8158 1587.2859 1612.8401 1672.1476 1681.2574 2975.8064 2981.7136 3008.0215 3077.5351 3079.5958 3097.0693 3124.0787 3140.2262 3144.2210 3169.6381 3180.9290 3509.4315
redmass: 9.0580 6.6619 5.3750 4.1891 2.4419 1.8402 1.6103 4.6425 1.9885 1.7870 4.6740 5.7794 4.4207 4.7153 4.9088 4.4014 3.7505 4.5288 3.3205 2.5253 4.1740 3.6417 3.9665 4.1979 3.7336 2.4404 2.3557 5.2006 4.0735 3.7705 1.6810 3.5040 4.3400 2.0580 4.2517 1.7651 1.6464 2.1759 3.5306 1.6461 2.4249 3.6106 1.2373 1.3785 1.7912 2.7169 1.1584 1.8034 1.7140 1.8209 1.9942 2.4072 6.0220 1.2968 2.0115 1.2966 1.1874 1.0571 1.0479 1.0579 1.0601 2.9565 7.5643 6.7409 8.4928 10.2564 1.0324 1.0671 1.0369 1.1013 1.0922 1.0970 1.1032 1.0899 1.1012 1.0923 1.0954 1.0639
irintensity: 1.5540 0.5507 0.6206 6.8166 3.4246 1.5508 1.0469 0.5001 2.6743 1.9189 2.7182 6.5542 6.0582 0.7981 4.2366 4.3465 3.5901 9.4349 10.1918 12.5780 20.1860 1.1658 9.2901 23.2774 26.2348 80.9099 72.1808 6.9063 13.7947 11.1959 37.1584 35.3195 29.4620 19.4621 34.0407 16.0064 6.8409 99.1842 39.6197 8.4912 402.6838 122.1406 5.5539 0.5863 96.8898 363.0643 8.8942 5.1527 30.3713 42.3746 56.7794 48.4737 9.5045 54.7719 26.3755 0.9745 48.3219 23.3432 20.3449 12.1308 6.9048 104.4354 22.1607 11.6875 194.2755 169.4358 71.7059 12.4908 1.3336 33.2120 4.3977 6.1321 22.0039 11.0549 10.6225 1.2261 2.7864 23.8455
temp: 298.150 k
press: 1.00000 atm
elementType: 8 8 8 8 8 6 6 6 6 6 6 6 6 6 6 6 1 1 1 1 1 1 1 1 1 1 1 1
symmnumber: 1
zpe: 552690.5 jmol-1
zpe.correction: 0.210509 hartree
zpe.thermalcorrener: 0.227281 hartree
zpe.thermalcorrenthalpy: 0.228225 hartree
zpe.thermalcorrgfe: 0.161822 hartree
zpe.sumelectzpe: -801.292915 hartree
zpe.sumelectthermal: -801.276143 hartree
zpe.sumelectthermalent: -801.275199 hartree
zpe.sumelectthermalfe: -801.341602 hartree
dipole: 0.1582 0.4763 -1.8913
dipole: 1.9568
quadrupole: -70.2014 -93.9825 -94.2798
quadrupole: 9.9348 -6.7942 1.8440
quadrupole: 15.9532 -7.8279 -8.1253 9.9348 -6.7942 1.8440
hfenergy: -801.5034242 hartree
pointgroup: C01 [X(C11H12O5)]
dipole: -0.0382599 0.1263598 0.7584462 debye
polarizability: 189.9232052|-7.1836444|139.8688617|-10.3924382|3.4574407|82.1948946 unknown
InChI: InChI=1S/C11H12O5/c1-7(12)16-9-4-3-8(6-11(13)14)5-10(9)15-2/h3-5,13H,6H2,1-2H3
charge 0 multiplicity 1
28 atoms
O  -0.965563 2.173965 -0.580363
O  -2.506026 0.040143 0.51944
O  5.287732 -0.478442 0.071784
O  3.834945 1.28695 0.468859
O  -3.309136 -1.833678 -0.662779
C  1.604859 -0.512048 -0.454741
C  0.973451 0.742759 -0.623492
C  3.06816 -0.706983 -0.819246
C  -0.390334 0.919638 -0.307048
C  0.849914 -1.5968 0.053995
C  -1.133925 -0.187555 0.186015
C  -0.515017 -1.43759 0.375694
C  4.039321 0.158352 -0.023149
C  -1.54803 2.898995 0.569708
C  -3.527544 -0.826914 0.032223
C  -4.868805 -0.305301 0.494165
H  1.527545 1.611353 -0.990602
H  3.236326 -0.450766 -1.885854
H  3.3743 -1.759584 -0.703933
H  1.32356 -2.574319 0.196872
H  -1.099348 -2.28163 0.750165
H  -0.767449 3.101851 1.327776
H  -2.376672 2.328353 1.022677
H  -1.917942 3.847313 0.151372
H  -4.864749 -0.148389 1.586002
H  -5.658876 -1.017824 0.217539
H  -5.071976 0.67142 0.020387
H  5.922377 0.11703 0.556535
