program: Gaussian 09
title: 000226477
version: EM64L-G09RevD.01
frameworkgroup: C1[X(C12H14O9)]
method: RPBEPBE
basis: SDD
operation: Freq
keyword: #pfreq=noraman
keyword: PBEPBE/SDD
title: #p freq=noraman PBEPBE/SDD
converged: YES YES NO NO
title: Mulliken charges:
elementType: O O O O O O O O O C C C C C C C C C C C C H H H H H H H H H H H H H H
charge: -0.205910 -0.211015 -0.274060 -0.280149 -0.278981 -0.171669 -0.223858 -0.226085 -0.224267 -0.177699 -0.138250 -0.074114 -0.134280 -0.086328 0.199665 0.297877 0.313828 0.339735 -0.755131 -0.753758 -0.751231 0.292166 0.286279 0.315517 0.311110 0.318123 0.251866 0.256846 0.253075 0.250234 0.262261 0.250921 0.258660 0.258285 0.250336
chargesum: 0.00000
title: Mulliken charges with hydrogens summed into heavy atoms:
elementType: O O O O O O O O O C C C C C C C C C C C C
charge: -0.205910 -0.211015 -0.274060 -0.280149 -0.278981 -0.171669 -0.223858 -0.226085 -0.224267 0.114467 0.148029 0.241403 0.176830 0.231795 0.199665 0.297877 0.313828 0.339735 0.006656 0.009658 0.016050
polarizability: 1.92426608e+02 5.37314142e+00 1.52679848e+02 5.58632871e+00 5.32347889e+00 1.21399536e+02
1716.lowfreq: -0.0009 -0.0006 -0.0004 4.6921 8.1253 12.0369 18.1101 29.9508 33.9971
frequency: 17.9837 29.8988 33.9229 44.9333 47.6859 52.9489 63.3763 67.5784 79.9809 81.0602 81.4621 97.6018 142.9925 158.4670 188.1245 190.7572 242.2468 265.5865 275.3788 294.2006 311.7517 354.3642 379.9751 436.6056 449.6437 496.4094 520.9473 556.1696 559.6624 562.1443 565.4484 599.4704 618.4932 639.8529 652.1931 667.3150 763.9001 793.9988 802.1056 824.0360 842.9196 856.0333 872.2275 885.9694 923.4892 955.4777 970.3414 975.7363 987.3359 994.7489 998.7031 1003.3578 1034.3616 1042.7699 1043.5673 1043.7804 1057.0809 1080.5661 1105.3259 1168.7958 1176.9115 1188.5793 1210.0982 1220.6471 1254.5799 1257.4571 1263.1855 1281.2496 1288.4859 1310.6826 1328.9510 1339.7202 1386.6852 1386.7609 1387.4894 1450.8381 1452.1126 1452.5246 1453.2795 1454.0303 1454.3417 1665.7520 1675.6377 1683.1285 1721.7475 3007.8815 3009.2028 3009.8194 3055.1389 3097.1553 3097.6955 3099.2287 3099.4914 3102.1022 3108.8422 3119.3569 3145.4996 3146.1032 3146.2698
redmass: 6.5721 7.5494 7.8159 8.7667 4.9496 3.2516 1.6544 1.2418 2.3017 1.8550 2.3212 1.6382 6.1258 5.9691 6.5181 10.7209 7.6478 7.9644 5.5676 6.3958 4.8379 5.1305 4.2174 5.0366 4.7444 5.3722 4.4216 3.2553 3.3590 4.0208 4.6735 5.9650 6.5565 5.5511 6.6664 8.2040 6.8469 6.5000 5.8794 6.4893 6.7433 6.5144 3.0672 5.7306 4.6120 3.2605 4.1809 2.7714 2.5111 2.5523 3.8225 3.3298 3.7893 1.6640 1.6637 1.6700 2.2534 2.2987 2.9585 3.0798 3.1032 3.1636 1.8606 1.8736 1.2961 1.2253 1.2844 1.3047 1.4185 1.4241 1.3408 1.4989 1.2345 1.2372 1.2437 1.0562 1.0560 1.0525 1.0472 1.0496 1.0528 10.0068 10.2278 10.0812 12.8346 1.0378 1.0379 1.0380 1.0830 1.0959 1.0878 1.0868 1.0955 1.0950 1.0880 1.0910 1.1021 1.1015 1.1015
irintensity: 0.6429 0.7145 0.4186 1.7496 1.9157 5.5028 1.5135 0.9049 0.2568 2.2422 2.1034 0.2904 2.6513 4.2646 8.8811 2.0755 9.7784 2.8681 4.0368 1.4339 7.7015 16.9474 3.8154 12.4010 10.1601 15.9207 9.6403 3.6247 2.1901 18.2296 9.8326 8.1329 4.2377 19.0557 14.7551 6.5096 12.7560 26.9373 60.9153 15.2384 54.0270 4.1074 88.9660 287.1228 20.4473 105.9823 75.9317 22.9355 116.2821 183.3562 68.5528 111.2186 18.8497 7.3484 15.4860 4.9414 37.3998 131.6436 95.3878 229.4357 449.7002 155.9033 15.1975 27.1389 7.4842 23.3268 6.3224 9.6906 9.5682 13.3643 3.1954 2.4363 56.1724 103.3749 10.4565 22.5291 24.4355 23.0998 21.6158 20.6367 21.0545 142.9166 143.9184 239.2058 277.6434 0.2833 0.6894 0.6594 29.3150 4.3033 7.8004 3.3631 5.2625 5.6615 5.8838 13.4166 6.9470 6.3015 9.5998
temp: 298.150 k
press: 1.00000 atm
elementType: 8 8 8 8 8 8 8 8 8 6 6 6 6 6 6 6 6 6 6 6 6 1 1 1 1 1 1 1 1 1 1 1 1 1 1
symmnumber: 1
zpe: 668963.3 jmol-1
zpe.correction: 0.254795 hartree
zpe.thermalcorrener: 0.276588 hartree
zpe.thermalcorrenthalpy: 0.277532 hartree
zpe.thermalcorrgfe: 0.199532 hartree
zpe.sumelectzpe: -1141.105964 hartree
zpe.sumelectthermal: -1141.084171 hartree
zpe.sumelectthermalent: -1141.083226 hartree
zpe.sumelectthermalfe: -1141.161226 hartree
dipole: -0.3280 -4.5786 -1.4267
dipole: 4.8069
quadrupole: -112.5359 -110.0470 -134.7058
quadrupole: 4.0811 -4.1566 10.3030
quadrupole: 6.5603 9.0493 -15.6096 4.0811 -4.1566 10.3030
hfenergy: -1141.3607582 hartree
pointgroup: C01 [X(C12H14O9)]
dipole: -0.9656265 -1.5781206 0.3919667 debye
polarizability: 173.8197947|-20.0871048|171.5274599|4.920486|-6.4800064|121.1587377 unknown
InChI: InChI=1S/C12H14O9/c1-4(13)17-9-7-8(20-11(9)16)10(18-5(2)14)12(21-7)19-6(3)15/h7-10,12H,1-3H3
charge 0 multiplicity 1
35 atoms
O  0.080327 -0.45434 1.419263
O  -0.621418 -0.555051 -1.947841
O  1.313498 -2.881706 0.093401
O  -3.104127 0.595895 0.043321
O  1.500791 0.82163 -0.038092
O  -1.58757 1.502706 -2.427895
O  3.598833 -2.626031 -0.29837
O  -3.027223 2.764512 0.924123
O  3.012607 1.523454 1.608538
C  -0.400676 -1.418958 -0.765355
C  -1.033662 -0.691129 0.46896
C  1.105088 -1.518087 -0.446334
C  -1.631411 0.610684 -0.089587
C  1.316462 -0.473003 0.665981
C  -1.302489 0.635725 -1.59659
C  2.656592 -3.331159 0.114498
C  -3.698307 1.787355 0.543413
C  2.367392 1.77594 0.575971
C  2.733227 -4.717347 0.704447
C  -5.200445 1.65857 0.512386
C  2.348702 3.059664 -0.214703
H  -0.831155 -2.406337 -0.984719
H  -1.785567 -1.283069 1.009243
H  1.755483 -1.339489 -1.316423
H  -1.229867 1.507386 0.413956
H  2.146765 -0.644055 1.365865
H  1.953231 -5.367627 0.27616
H  2.559609 -4.666107 1.794484
H  3.729817 -5.143055 0.519772
H  -5.515127 0.646719 0.813084
H  -5.556502 1.826427 -0.520296
H  -5.651463 2.415376 1.170342
H  1.363429 3.548465 -0.108374
H  2.495875 2.853515 -1.287812
H  3.131983 3.736231 0.155583
