program: Gaussian 09
title: 000226476
version: EM64L-G09RevD.01
frameworkgroup: C1[X(C10H11NO3)]
method: RPBEPBE
basis: SDD
operation: Freq
keyword: #p
keyword: freq=noraman
keyword: PBEPBE/SDD
title: #p freq=noraman PBEPBE/SDD
converged: YES YES NO NO
title: Mulliken charges:
elementType: O O O N C C C C C C C C C C H H H H H H H H H H H
charge: -0.253877 -0.248017 -0.252042 -0.592080 -0.283367 0.493617 -0.350136 -0.460526 0.220588 -0.223226 -0.221035 -0.236315 0.317165 -0.757268 0.241780 0.277631 0.228919 0.229045 0.228359 0.230634 0.320017 0.336566 0.250319 0.260755 0.242494
chargesum: 0.00000
title: Mulliken charges with hydrogens summed into heavy atoms:
elementType: O O O N C C C C C C C C C C
charge: -0.253877 -0.248017 -0.252042 0.064502 -0.041587 0.493617 -0.072505 -0.231608 0.220588 0.005820 0.007324 -0.005681 0.317165 -0.003700
polarizability: 1.54658244e+02 7.94997404e+00 9.27369353e+01 2.01403526e+00 -1.16754510e+01 1.15570019e+02
1716.lowfreq: -8.1124 -5.5326 -1.7022 -0.0003 -0.0001 0.0006 13.1612 27.0892 52.7659
frequency: 10.9428 26.9077 52.7494 71.5935 77.1397 89.5792 114.5680 214.2423 236.5498 269.1595 307.4442 339.7355 403.0330 441.9695 469.9407 503.7018 554.6203 561.1967 574.5162 613.6481 627.7536 664.5811 701.7811 708.9006 758.8326 833.6742 849.4105 854.9558 893.9360 930.6581 954.8323 978.8171 990.2743 998.3701 999.8451 1027.1389 1042.9351 1057.6848 1083.7171 1173.1711 1187.3671 1192.5307 1197.4383 1250.6772 1294.3662 1332.6760 1349.7375 1383.8312 1386.3655 1441.9139 1452.9325 1454.0620 1483.6611 1594.0644 1600.7947 1613.8857 1647.4338 1657.9231 3007.8843 3020.4467 3101.5214 3116.5056 3129.7601 3141.8153 3142.9064 3155.7430 3167.5351 3519.7729 3671.8873
redmass: 4.9101 3.9409 6.2158 2.7514 1.3537 3.3553 5.7192 6.6543 4.7049 5.0828 6.3589 3.7117 2.8045 3.1736 1.5090 2.0088 2.9802 3.1022 2.3567 6.3970 2.4688 5.4954 2.0758 3.4875 1.9713 4.4452 4.3636 1.2543 2.9451 1.9365 4.0742 1.4041 5.4328 1.7695 1.4976 2.1688 1.6559 1.9423 1.6145 1.0602 1.2206 1.5183 2.6435 2.1176 1.7056 1.2844 2.5103 1.3126 6.0732 2.1855 1.0549 1.0581 2.3385 4.9481 1.4839 5.7556 9.4899 3.9956 1.0378 1.0852 1.0946 1.0878 1.0869 1.1024 1.0920 1.0961 1.1012 1.0450 1.1041
irintensity: 17.5895 1.4338 1.5691 2.4071 0.1771 6.4554 3.8396 9.4981 0.9011 0.9892 1.3515 5.5749 0.7143 9.9486 42.6915 41.2586 37.0365 6.5965 92.2165 0.0106 74.4537 16.3321 61.4012 11.9506 45.3408 6.3585 10.0428 0.3508 29.3554 59.5962 54.3853 0.0697 5.1310 49.5931 22.3055 4.4344 10.2343 0.2031 9.5411 0.3346 54.6391 19.6061 308.8105 31.5148 27.3140 1.0346 99.2876 51.3684 6.5229 9.0250 16.8764 24.4590 13.6965 5.0876 53.8168 0.8752 236.4271 215.5812 1.2874 15.1786 7.3183 8.1036 1.3988 9.8676 24.0841 19.0334 18.1705 43.0873 27.0815
temp: 298.150 k
press: 1.00000 atm
elementType: 8 8 8 7 6 6 6 6 6 6 6 6 6 6 1 1 1 1 1 1 1 1 1 1 1
symmnumber: 1
zpe: 506989.0 jmol-1
zpe.correction: 0.193102 hartree
zpe.thermalcorrener: 0.207002 hartree
zpe.thermalcorrenthalpy: 0.207946 hartree
zpe.thermalcorrgfe: 0.149139 hartree
zpe.sumelectzpe: -667.080528 hartree
zpe.sumelectthermal: -667.066628 hartree
zpe.sumelectthermalent: -667.065684 hartree
zpe.sumelectthermalfe: -667.124491 hartree
dipole: -1.9737 0.3904 -2.2140
dipole: 2.9916
quadrupole: -78.9465 -71.3873 -80.0106
quadrupole: -3.3440 1.6957 -7.0299
quadrupole: -2.1650 5.3941 -3.2291 -3.3440 1.6957 -7.0299
hfenergy: -667.2736297 hartree
pointgroup: C01 [X(C10H11N1O3)]
dipole: -0.7816552 0.4144529 -0.7762371 debye
dipolederiv: -1.6981463 0.2656334 0.2568478 0.3172993 -0.5206474 -0.0358082 0.2464684 -0.0584908 -0.2829868 -0.4566784 0.0400953 -0.1637468 -0.054012 -0.6613971 0.0171304 -0.2304282 0.1938014 -0.8302343 -0.8667204 0.0474343 0.1404223 -0.3377496 -0.7382301 0.1835533 0.2618794 0.0893203 -0.4094147 -0.6286999 0.042138 0.077814 -0.0206247 -1.1250018 0.1999186 0.0881934 0.0405739 -0.284786 0.6887463 -0.2239722 -0.2167698 -0.4535465 0.3193079 0.0205638 -0.1529637 -0.0721659 0.1656792 0.1611227 0.1002791 0.0780132 -0.0169408 -0.0769204 -0.0356077 -0.0463277 -0.0559568 -0.0668548 -0.0559354 -0.0333804 0.0723306 -0.0606092 -0.1257194 -0.0241577 0.0376074 -0.013218 -0.0258848 -0.0777603 0.0216372 -0.0729245 0.0172558 -0.1250676 -0.0755458 0.0369944 -0.0706004 0.0223688 0.2565352 0.0407082 0.2317199 0.2822861 1.4576635 -0.1570869 0.312532 -0.1489948 0.9108629 -0.0608717 0.0480874 -0.0775866 0.0711605 -0.0769823 -0.1106053 -0.0640536 -0.1140005 0.0689125 -0.0183437 -0.0267852 0.1070028 -0.0276188 -0.1141065 -0.0498416 0.1227447 -0.0547686 0.0167495 0.0799843 0.0410698 -0.007786 0.0452 -0.129089 -0.0470292 -0.0145134 -0.0446611 -0.0594456 1.9424291 -0.3237772 -0.3343338 0.159612 1.0319517 -0.2625936 -0.4358228 -0.1564216 0.363905 -0.1723471 0.1721304 -0.0216059 0.1808823 -0.286924 0.0719004 -0.0738745 0.158543 -0.0161253 0.0302713 0.0009921 0.0105547 0.0533347 -0.0508954 0.0402367 0.0094899 0.0550103 -0.069867 0.0793893 0.0299184 -0.0661429 0.0141363 0.1404446 0.0256747 -0.0789489 0.0297078 0.0495021 0.0558469 -0.0528221 0.0861813 -0.0444337 0.0965179 0.0916787 0.0608004 0.0854426 -0.0317959 0.0453266 -0.0416523 0.049309 -0.0481957 0.1003601 0.0990617 0.0696634 0.1016916 -0.0405757 -0.0152231 0.0142662 -0.0999218 0.0209081 0.1334617 0.0641728 -0.1142262 0.0603889 -0.0173882 -0.1249193 -0.054985 0.0138096 -0.0601522 0.1335362 0.0288373 0.0129733 0.0276896 0.1005687 0.3596545 -0.0265214 -0.041284 0.003849 0.2413145 -0.0036028 -0.0562765 0.0044504 0.1234394 0.3672917 -0.0380533 -0.057101 -0.006949 0.1924258 -0.0057888 -0.0514249 0.0246993 0.169461 0.0358209 -0.0992946 -0.0399019 -0.0654468 0.0063533 -0.0288323 -0.0134321 -0.0580873 0.1187274 0.1167052 0.0221786 -0.0173488 0.0117157 0.1007332 -0.0218139 -0.0376898 -0.0017373 -0.0424326 -0.0434783 0.034675 0.0924486 0.0186393 0.0769104 0.0155853 0.1106358 -0.0222163 0.0676151 unknown
polarizability: 155.065607|5.5570244|100.7668741|2.9994278|-16.2236155|107.1327171 unknown
InChI: InChI=1S/C10H11NO3/c1-7(12)14-9(10(11)13)8-5-3-2-4-6-8/h2-6,9H,11H2,1H3
charge 0 multiplicity 1
25 atoms
O  1.229872 -0.929456 -0.292562
O  1.297202 0.850655 1.915016
O  3.127943 0.205661 -1.028233
N  0.990114 2.628255 0.448604
C  0.483286 0.358326 -0.371622
C  -0.991383 0.033312 -0.234947
C  -1.478469 -0.587381 0.943838
C  -1.890562 0.353711 -1.28022
C  0.983337 1.288125 0.77337
C  -2.852447 -0.882153 1.068528
C  -3.26778 0.062196 -1.151453
C  -3.750813 -0.557042 0.023611
C  2.595264 -0.848488 -0.612673
C  3.275638 -2.173119 -0.367208
H  0.701563 0.826421 -1.349719
H  -0.77659 -0.828606 1.749103
H  -1.515261 0.820396 -2.199743
H  -3.225247 -1.363371 1.979467
H  -3.957725 0.311168 -1.965273
H  -4.817516 -0.786747 0.124418
H  0.839526 2.957249 -0.503313
H  1.267425 3.299361 1.164665
H  2.605186 -3.011589 -0.612747
H  3.530344 -2.249431 0.705704
H  4.203592 -2.231752 -0.955111
