program: Gaussian 09
title: 000226471
version: EM64L-G09RevD.01
frameworkgroup: C1[X(C20H28O6S2)]
method: RPBEPBE
basis: SDD
operation: Freq
keyword: #p
keyword: freq=noraman
keyword: PBEPBE/SDD
title: #p freq=noraman PBEPBE/SDD
converged: YES YES NO NO
title: Mulliken charges:
elementType: S S O O O O O O C C C C C C C C C C C C C C C C C C C C H H H H H H H H H H H H H H H H H H H H H H H H H H H H
charge: 1.038749 1.002606 -0.432246 -0.522754 -0.503434 -0.401835 -0.512133 -0.508882 0.363851 -0.147847 -0.108598 -0.168920 -0.138203 -0.521504 -0.556445 -0.485420 -0.438209 -0.510448 -0.806717 0.253277 -0.576649 0.311707 -0.332079 -0.514951 -0.396969 0.312366 -0.726619 -0.744555 0.218393 0.244894 0.215245 0.271245 0.202474 0.221133 0.215438 0.231002 0.230213 0.195807 0.239443 0.224913 0.227901 0.217521 0.237818 0.221973 0.233530 0.232415 0.231782 0.228895 0.260302 0.254160 0.282697 0.284996 0.289465 0.288876 0.287715 0.282618
chargesum: 0.00000
title: Mulliken charges with hydrogens summed into heavy atoms:
elementType: S S O O O O O O C C C C C C C C C C C C C C C C C C C C
charge: 1.038749 1.002606 -0.432246 -0.522754 -0.503434 -0.401835 -0.512133 -0.508882 0.363851 0.070545 0.136296 0.046325 0.133042 -0.097896 -0.110005 -0.059400 0.026147 -0.065027 -0.113396 0.253277 -0.112452 0.311707 -0.103184 -0.254649 -0.142809 0.312366 0.130538 0.114654
polarizability: 5.13415319e+02 -8.68693106e+00 2.62286403e+02 3.12920973e+01 6.63612576e+00 2.18256501e+02
1716.lowfreq: -6.0515 -3.6767 -0.0018 0.0007 0.0017 10.1439 13.0817 16.4879 18.6254
frequency: 12.2879 16.4091 18.5073 26.8705 30.9807 43.4335 49.7327 75.6072 96.6212 105.5809 118.6142 128.8821 141.2843 149.9499 153.0704 161.5407 168.4843 176.8260 194.0101 206.3614 218.4711 225.5496 240.7850 243.3684 251.2186 269.5548 285.2358 301.8849 312.2507 320.6770 337.8665 352.0956 360.7360 368.7622 374.9036 396.8440 405.2347 439.6377 444.2132 453.3666 460.9209 484.0887 500.3313 510.4228 531.2200 558.8710 570.1377 586.1478 602.1860 619.3992 637.3921 646.5013 711.1626 723.1083 728.4053 787.6691 818.9896 823.7884 829.2823 833.4750 835.4607 843.2184 852.4685 893.1968 898.3962 910.1836 911.3960 916.6305 927.8641 942.0239 957.3769 963.8707 969.1730 981.4546 992.1117 995.1014 1010.8720 1024.1774 1024.6911 1031.1846 1035.2813 1043.0601 1058.8368 1077.3306 1086.6429 1100.7540 1119.1429 1129.8519 1133.5648 1154.8922 1168.8985 1175.6997 1176.4536 1198.5446 1212.2160 1216.0947 1228.1876 1235.9988 1247.8781 1251.7177 1262.6344 1274.5968 1284.1812 1285.6184 1290.5357 1303.1785 1309.4937 1313.3841 1315.9961 1324.1745 1332.3501 1336.1465 1340.2916 1349.8497 1352.6316 1363.2388 1374.5128 1392.3451 1411.6636 1413.3875 1416.8567 1418.3427 1418.9727 1453.6146 1459.5488 1467.7977 1472.4915 1472.6866 1478.1173 1478.8632 1490.2337 1492.2477 1550.2196 1594.4540 2898.6878 2912.1286 2960.0525 2963.6362 2964.9174 2974.7652 2977.8500 2989.7246 2998.1971 3000.8888 3023.2233 3025.1879 3030.5999 3040.5238 3040.8045 3042.2098 3047.2062 3056.8855 3084.7557 3090.2005 3096.7845 3142.1483 3148.7362 3171.8775 3188.4835 3189.5428 3197.9874 3198.4958
redmass: 6.8555 5.9357 7.5250 6.5225 4.9128 5.6300 4.1469 5.2233 6.0889 5.7735 2.8669 3.1704 1.1668 4.4065 2.5577 1.4919 1.8748 2.6814 3.1794 2.4119 1.7273 3.8385 2.8992 4.5551 3.8039 2.9507 3.7517 4.4660 4.3729 7.8908 7.2533 2.8754 7.0452 3.5647 5.9851 4.2953 4.5190 2.8139 4.1203 4.5177 4.0454 3.2385 3.6063 4.4048 3.3635 5.7134 3.9160 4.7800 6.8999 3.0315 4.1165 3.0854 3.2399 2.4460 4.5858 2.8786 2.0655 5.4111 1.9062 8.7482 1.5998 2.1686 1.9649 2.0535 3.2151 2.8500 1.7792 2.6564 2.2863 2.0982 2.9610 1.3956 1.9223 1.3107 2.1184 1.4923 2.0845 1.8057 2.1569 1.9491 2.0439 2.3362 2.5570 2.8288 1.7948 2.0297 2.0440 2.2342 1.3763 2.1010 1.6280 1.6140 1.5433 2.2429 1.3295 1.5085 2.5074 1.4669 1.4385 1.7380 1.4213 1.3517 1.3649 1.3380 1.4267 1.3876 1.1334 1.1411 1.3520 1.5225 1.4755 1.3119 1.3549 1.4557 1.4533 4.5156 1.6015 1.2201 3.1157 1.1336 1.0522 1.0509 1.0525 1.1645 1.0733 1.0826 1.0960 1.0846 1.0735 2.2094 1.0641 1.0763 7.0681 6.4983 1.0796 1.0799 1.0792 1.0629 1.0648 1.0683 1.0832 1.0608 1.0542 1.0438 1.0626 1.0946 1.0968 1.0248 1.0246 1.1007 1.1023 1.1019 1.1035 1.0990 1.0983 1.0918 1.0869 1.0967 1.1077 1.1080 1.1073 1.1077
irintensity: 0.9110 2.3874 5.9428 1.7631 1.8420 2.2001 1.8922 11.6268 2.4564 0.7118 5.2256 0.9786 1.4008 7.2439 8.0233 0.4407 0.7482 13.7770 1.6413 0.8817 4.1881 3.8822 3.4247 4.4998 2.5508 0.9995 8.0439 11.7071 6.1309 45.6652 13.6840 7.4799 50.5129 10.4157 8.9934 6.0293 5.8271 5.9020 6.8006 3.0638 31.8477 16.7210 10.5046 3.4109 9.6119 14.1159 32.2942 43.7928 84.8745 3.3904 1.6622 3.4510 3.8266 6.6054 1.6282 3.9240 1.4748 36.4066 13.2546 63.7110 25.5777 12.9002 8.1600 20.5449 26.3870 31.7543 8.7670 20.4113 2.4615 45.7321 39.0853 1.2366 9.1917 69.1562 8.7084 25.6419 4.3202 40.1525 11.0196 1.4038 60.1376 8.6135 1.3005 6.9092 4.8714 13.5758 3.6494 5.7436 2.5436 19.8503 2.3356 6.4425 8.4271 5.6881 5.6420 7.3051 16.8534 7.1536 6.7053 1.5674 6.2795 2.5940 10.1863 3.0037 7.9011 1.0592 2.8404 3.6856 2.1537 19.4027 9.3256 3.5961 3.6217 1.7214 3.0453 4.7982 2.0972 24.9159 9.6951 9.9949 13.7721 13.1672 9.1488 13.5215 4.7241 7.1262 5.8291 26.4917 3.3178 40.7024 3.5681 10.8815 31.0767 81.6848 6.3742 16.2202 4.4749 35.4139 13.8814 40.1569 25.2065 21.4113 22.7507 29.5110 20.3807 32.8747 29.6609 0.0642 0.0621 35.6844 54.5050 16.2267 34.5731 20.5458 42.4977 3.2043 9.7142 8.6167 0.1958 0.0167 0.0306 0.0254
temp: 298.150 k
press: 1.00000 atm
elementType: 16 16 8 8 8 8 8 8 6 6 6 6 6 6 6 6 6 6 6 6 6 6 6 6 6 6 6 6 1 1 1 1 1 1 1 1 1 1 1 1 1 1 1 1 1 1 1 1 1 1 1 1 1 1 1 1
symmnumber: 1
zpe: 1174279.9 jmol-1
zpe.correction: 0.447260 hartree
zpe.thermalcorrener: 0.477174 hartree
zpe.thermalcorrenthalpy: 0.478118 hartree
zpe.thermalcorrgfe: 0.383265 hartree
zpe.sumelectzpe: -2023.921029 hartree
zpe.sumelectthermal: -2023.891115 hartree
zpe.sumelectthermalent: -2023.890171 hartree
zpe.sumelectthermalfe: -2023.985024 hartree
dipole: 1.0674 -1.4275 -1.8227
dipole: 2.5494
quadrupole: -179.9687 -173.3155 -194.2863
quadrupole: 32.4014 -23.0138 0.3043
quadrupole: 2.5548 9.2080 -11.7628 32.4014 -23.0138 0.3043
hfenergy: -2024.3682886 hartree
pointgroup: C01 [X(C20H28O6S2)]
dipole: -0.439268 0.5282518 -0.7307574 debye
polarizability: 512.5966517|-6.3489244|261.4960216|-35.4785205|-8.6114708|219.8655499 unknown
InChI: InChI=1S/C20H28O6S2/c1-20-11-10-16-15-7-5-14(25-27(2,21)22)12-13(15)4-6-17(16)18(20)8-9-19(20)26-28(3,23)24/h5,7,12,16-19H,4,6,8-11H2,1-3H3
charge 0 multiplicity 1
56 atoms
S  6.829131 0.695146 0.053285
S  -6.815568 0.503905 0.994604
O  5.045272 0.84468 0.615892
O  6.846384 0.492581 -1.556369
O  7.654123 -0.32551 1.000544
O  -5.883231 0.063147 -0.762358
O  -6.476786 -0.628042 2.113469
O  -6.682794 2.07875 1.378759
C  2.672293 0.229115 0.246663
C  2.015193 -1.134871 -0.151445
C  0.489173 -1.121098 0.043151
C  -0.116935 0.002316 -0.857222
C  4.160608 -0.158442 -0.011289
C  2.101011 1.333396 -0.67065
C  2.874267 -2.204185 0.575084
C  0.549466 1.386293 -0.597053
C  4.319405 -1.596774 0.571657
C  -0.186541 -2.465345 -0.300021
C  2.474304 0.596579 1.741508
C  -1.650672 0.023466 -0.779126
C  -1.680021 -2.419886 0.079171
C  -2.381212 -1.138742 -0.367807
C  -2.380182 1.188361 -1.154328
C  -3.790978 -1.099172 -0.344097
C  -3.782859 1.231168 -1.124351
C  -4.500809 0.068112 -0.731368
C  7.264294 2.483429 0.508991
C  -8.531266 0.173769 0.246594
H  2.195883 -1.260189 -1.244998
H  0.263293 -0.890904 1.106251
H  0.145163 -0.280586 -1.905083
H  4.353656 -0.151985 -1.104431
H  2.407698 1.129113 -1.718053
H  2.516527 2.322938 -0.399514
H  2.835395 -3.181153 0.063052
H  2.512471 -2.36258 1.608519
H  0.222862 1.769352 0.389112
H  0.200666 2.120732 -1.346723
H  4.739421 -1.535422 1.590927
H  5.022421 -2.195607 -0.032844
H  0.305534 -3.296951 0.238027
H  -0.070836 -2.666116 -1.385064
H  3.035239 1.518459 1.973913
H  1.413057 0.774204 1.982856
H  2.844785 -0.193972 2.416571
H  -1.773084 -2.500119 1.182202
H  -2.213862 -3.295795 -0.336209
H  -1.838366 2.084355 -1.471344
H  -4.366235 -1.976115 -0.025236
H  -4.338184 2.132105 -1.403205
H  8.337229 2.596632 0.301292
H  6.636059 3.118795 -0.127519
H  7.026348 2.588197 1.575431
H  -8.633067 0.877729 -0.589029
H  -8.515467 -0.871066 -0.087954
H  -9.257875 0.3560 1.050363
