program: Gaussian 09
title: 000226462
version: EM64L-G09RevD.01
frameworkgroup: C1[X(C8H15NO4)]
method: RPBEPBE
basis: SDD
operation: Freq
keyword: #p
keyword: freq=noraman
keyword: PBEPBE/SDD
title: #p freq=noraman PBEPBE/SDD
converged: YES YES NO NO
title: Mulliken charges:
elementType: O O O O N C C C C C C C C H H H H H H H H H H H H H H H
charge: -0.279371 -0.264178 -0.409335 -0.236496 -0.594027 -0.406749 -0.204588 -0.505492 0.032879 0.274094 0.140215 -0.682962 -0.685285 0.240837 0.214575 0.312712 0.248456 0.277568 0.232434 0.283246 0.286843 0.212219 0.250905 0.220641 0.207649 0.231654 0.223761 0.377794
chargesum: 0.00000
title: Mulliken charges with hydrogens summed into heavy atoms:
elementType: O O O O N C C C C C C C C
charge: -0.279371 -0.264178 -0.031541 -0.236496 -0.023937 0.048663 0.108124 0.020531 0.265314 0.274094 0.140215 0.000803 -0.022221
polarizability: 1.39254166e+02 -7.62763564e-01 9.51094364e+01 3.67214316e-01 2.45548000e+00 8.97033508e+01
1716.lowfreq: -6.4502 -0.0001 0.0005 0.0007 3.6924 7.2189 17.8212 34.8696 43.7739
frequency: 17.7451 34.8309 43.7315 63.8073 77.1822 102.1251 151.8023 176.4725 184.8489 207.4442 209.1322 233.2687 274.2824 281.1568 333.0134 374.8853 383.9094 422.7615 467.4387 502.7759 550.7533 576.4008 609.1563 669.9934 690.5699 704.0221 766.2974 790.0509 847.7006 904.7431 907.1867 925.5837 941.2295 965.0750 973.6371 1039.6611 1068.5315 1094.0879 1122.5202 1137.9667 1158.5789 1163.2072 1184.3561 1222.9743 1225.4319 1275.1280 1299.4716 1318.7742 1332.4729 1336.8874 1356.4685 1378.4470 1387.0696 1395.9453 1430.0442 1456.4261 1460.3728 1464.4045 1472.4112 1487.0426 1623.1782 1649.6102 1656.0882 2982.5017 2988.8939 2992.9612 2997.0878 3027.7847 3045.5798 3066.2415 3075.9681 3083.8959 3093.2061 3098.3249 3104.3103 3450.5264 3501.9657 3573.0130
redmass: 4.6004 5.6952 5.5948 4.1751 4.6377 3.9016 3.6340 3.0810 1.0359 2.6249 1.2067 1.1546 3.9132 3.3653 2.6151 3.0300 3.2912 2.6165 2.8873 2.9390 3.4029 1.7793 2.1568 4.0401 3.4730 1.5641 2.9470 3.0278 4.0805 3.0997 2.8330 1.2378 1.3539 2.2723 2.2785 2.6867 2.1303 2.0602 2.1629 1.4427 2.0308 2.4823 1.9099 1.3771 1.3571 1.7594 1.4120 1.3124 1.4728 1.3795 1.5371 1.2594 1.3799 1.2346 1.1067 1.0531 1.0914 1.0478 1.0495 1.0485 9.1807 7.3331 1.1162 1.0643 1.0356 1.0359 1.0638 1.0865 1.0844 1.0941 1.0999 1.0993 1.0987 1.1006 1.1006 1.0460 1.0641 1.0960
irintensity: 0.4595 0.5082 0.7424 1.3070 1.0209 2.2172 5.7133 1.1501 0.0491 4.3679 32.8026 0.5023 4.1475 14.8307 4.3894 22.8042 15.1530 5.1279 14.7360 7.2465 0.6559 75.1954 49.8207 2.7836 47.5727 251.7903 18.8278 4.3913 10.3724 44.3554 8.3738 2.5180 0.5171 13.4629 19.6167 228.7479 42.1802 321.6274 187.8367 1.5910 10.4845 72.8191 2.4500 5.7724 12.2857 14.7336 54.8780 11.6965 14.4753 3.3931 32.0345 32.9447 1.3247 15.2654 35.4199 5.6622 14.2475 4.7613 5.3718 20.2281 152.3348 263.5872 17.9768 35.5937 16.2405 24.0508 23.7300 6.2674 9.7293 10.3301 11.8842 5.6578 53.2996 21.1407 32.5491 1.8211 12.4215 6.7331
temp: 298.150 k
press: 1.00000 atm
elementType: 8 8 8 8 7 6 6 6 6 6 6 6 6 1 1 1 1 1 1 1 1 1 1 1 1 1 1 1
symmnumber: 1
zpe: 601989.8 jmol-1
zpe.correction: 0.229286 hartree
zpe.thermalcorrener: 0.244916 hartree
zpe.thermalcorrenthalpy: 0.245861 hartree
zpe.thermalcorrgfe: 0.184379 hartree
zpe.sumelectzpe: -668.468485 hartree
zpe.sumelectthermal: -668.452855 hartree
zpe.sumelectthermalent: -668.451910 hartree
zpe.sumelectthermalfe: -668.513392 hartree
dipole: 1.6013 -0.2009 0.2899
dipole: 1.6397
quadrupole: -73.2953 -74.9238 -77.0963
quadrupole: 4.1608 -0.5591 -2.8587
quadrupole: 1.8099 0.1813 -1.9911 4.1608 -0.5591 -2.8587
hfenergy: -668.6977709 hartree
pointgroup: C01 [X(C8H15N1O4)]
dipole: 0.6363293 -0.0685015 -0.0810446 debye
polarizability: 139.2003045|0.9777514|91.9223971|1.5759805|-3.587873|92.9442515 unknown
InChI: InChI=1S/C8H15NO4/c1-5(2)13-7(10)4-3-6(9)8(11)12/h5-6,11H,3-4,9H2,1-2H3
charge 0 multiplicity 1
28 atoms
O  2.406743 -0.552377 -0.064624
O  0.787013 1.122402 -0.178898
O  -3.336247 1.104905 -1.485781
O  -4.552833 -0.105898 0.076415
N  -2.19496 -0.599526 1.616328
C  -1.272494 -0.920925 -0.688887
C  -2.076254 0.00302 0.282687
C  0.119837 -1.26484 -0.127059
C  3.49468 0.494205 0.010724
C  1.089605 -0.09706 -0.134179
C  -3.446599 0.308341 -0.339423
C  3.635585 0.954997 1.468474
C  4.744658 -0.182771 -0.554629
H  -1.194063 -0.4218 -1.670675
H  -1.834112 -1.865088 -0.831197
H  -1.509373 0.947967 0.354693
H  0.579734 -2.108102 -0.671204
H  -0.01259 -1.585722 0.926703
H  3.170265 1.340413 -0.623274
H  -2.9453 -1.298792 1.671512
H  -2.27756 0.085968 2.373103
H  4.447883 1.700299 1.551389
H  2.702165 1.423793 1.822277
H  3.880375 0.099582 2.122817
H  5.590058 0.528957 -0.555321
H  4.573309 -0.523037 -1.590121
H  5.026109 -1.057618 0.057647
H  -4.242135 1.263408 -1.868499
