program: Gaussian 09
title: 000238046
version: EM64L-G09RevD.01
frameworkgroup: C1[X(C16H16Cl2N4O7)]
method: RPBEPBE
basis: SDD
operation: Freq
keyword: #p
keyword: freq=noraman
keyword: PBEPBE/SDD
title: #p freq=noraman PBEPBE/SDD
converged: YES YES NO NO
title: Mulliken charges:
elementType: Cl Cl O O O O O O O N N N N C C C C C C C C C C C C C C C C H H H H H H H H H H H H H H H H
charge: 0.050933 0.038511 -0.474341 -0.478728 -0.456009 -0.472721 -0.441083 -0.187385 -0.193226 -0.164661 0.118081 -0.252565 -0.408702 -0.185373 -0.096241 -0.141855 -0.515619 -0.128062 0.393480 0.239855 -0.329229 -0.014035 -0.168194 -0.276819 -0.300935 0.166554 -0.134292 -0.118009 0.071724 0.287901 0.223738 0.240306 0.249851 0.294162 0.224589 0.234497 0.188779 0.360916 0.436672 0.386470 0.317852 0.377585 0.308329 0.371735 0.355567
chargesum: 0.00000
title: Mulliken charges with hydrogens summed into heavy atoms:
elementType: Cl Cl O O O O O O O N N N N C C C C C C C C C C C C C C C C
charge: 0.050933 0.038511 -0.113425 -0.042056 -0.069539 -0.095136 -0.085516 -0.187385 -0.193226 -0.164661 0.118081 -0.252565 -0.036967 0.102528 0.127497 0.098451 0.028394 0.096526 0.393480 0.239855 0.094047 -0.014035 -0.168194 0.041033 0.007393 0.166554 -0.134292 -0.118009 0.071724
polarizability: 3.10625816e+02 2.19670531e+01 4.18394856e+02 -1.76733154e+01 1.86180390e+00 1.28511772e+02
1716.lowfreq: -2.6527 -0.0014 0.0004 0.0009 3.9371 5.8152 18.9071 29.9300 33.8949
frequency: 18.6599 29.8509 33.8627 41.9867 46.6873 54.4356 82.3371 83.2045 102.5268 107.0649 125.8898 136.4901 148.6026 162.2220 169.7540 175.9195 184.5589 219.2972 233.6066 250.0034 262.5163 265.4457 273.9469 281.1989 295.7915 349.5617 361.8689 369.5212 376.1104 392.5597 405.4957 446.1837 452.0212 460.6496 484.5838 491.1843 492.4497 507.6264 514.3884 528.0544 542.6016 563.3524 592.2735 599.5098 619.7807 622.8803 634.1345 649.7470 656.8722 663.9129 707.2274 720.7399 724.8769 735.1154 771.6670 783.0379 796.0405 818.1934 834.6500 855.7346 866.3649 880.8403 892.7451 901.5166 922.6616 945.2041 970.9933 983.5410 1002.4737 1017.9222 1032.0339 1042.5632 1059.8857 1065.6427 1088.6346 1113.2515 1115.2012 1131.2299 1167.3338 1177.2013 1181.4928 1215.0547 1219.7380 1233.0909 1260.7789 1263.2079 1266.0267 1286.2959 1301.2718 1311.5154 1316.2352 1323.9995 1332.7590 1338.8563 1345.9276 1360.8547 1364.8377 1367.4058 1370.4880 1382.9146 1384.2035 1396.9764 1412.0667 1455.8453 1461.8938 1462.2292 1477.0769 1491.8382 1525.8141 1542.8935 1600.7863 1636.1118 1640.3335 2926.8811 2949.7552 2960.6692 2983.5323 3005.7255 3038.8173 3062.5206 3097.3726 3120.4854 3157.7801 3186.8677 3461.2386 3493.7366 3507.5724 3521.9546 3527.4140
redmass: 8.2262 9.4518 6.6680 8.7265 12.0689 9.0113 8.6568 6.0549 6.1607 5.9635 4.3647 9.5992 8.6752 7.1204 7.7019 6.1500 24.4010 6.6466 9.0828 10.5799 5.0512 8.1429 8.0896 5.5554 5.1622 5.6812 10.1529 4.8559 7.0512 5.7719 5.1423 3.7886 6.2564 5.6612 1.6019 1.8149 2.3658 3.6678 2.0613 5.5420 6.7312 4.5133 3.7493 4.2101 2.0376 7.6459 1.8301 1.4199 4.2636 4.5173 4.2626 4.6595 4.8093 4.2121 2.0296 5.6014 4.8948 5.7065 4.2798 2.5677 1.5702 1.3719 1.7199 1.4446 8.9289 5.2208 5.3885 4.0886 4.8698 2.6786 3.7809 2.5283 3.3840 2.6626 4.0110 2.4188 2.3683 4.2540 1.1662 1.8890 2.4116 1.1936 4.2540 1.7799 1.3857 1.5403 1.1794 4.9095 1.2606 1.2423 1.6131 1.2516 1.7838 2.2602 1.3995 1.4833 1.3676 1.5214 1.3164 1.3872 5.1131 1.6399 6.2747 2.1370 1.0920 1.6695 1.4735 4.5247 7.2940 8.5034 7.6643 6.7098 7.6201 1.0818 1.0700 1.0713 1.0831 1.0848 1.0639 1.0870 1.0944 1.1005 1.0935 1.0936 1.0650 1.0654 1.0770 1.0654 1.0650
irintensity: 0.9026 1.4564 0.5554 1.5200 0.8500 0.4243 1.5217 7.7231 19.6415 1.7210 0.2629 4.1638 5.6616 1.8106 1.1468 4.5415 0.1250 3.6001 0.5115 0.6170 2.9317 0.7846 3.9881 12.2716 2.8166 3.2118 15.2617 4.2362 24.5160 7.3781 9.9695 17.0475 13.5418 5.5157 22.4521 100.3724 142.2298 2.0300 13.3857 29.9405 7.5415 2.2187 22.0583 27.4640 121.4448 10.2721 64.8539 276.7467 19.9465 24.4281 6.1530 33.0451 57.0340 5.5507 65.0497 5.8888 38.8932 67.1163 17.5058 29.6360 55.0682 2.7462 50.4451 49.8278 24.8885 48.6524 47.1052 62.4432 18.0122 27.1726 75.9899 16.7775 36.8663 11.1228 26.3542 69.3844 28.8936 84.0252 24.5799 37.8241 111.6615 45.8267 129.0464 137.3176 11.2366 9.3852 68.7635 12.5816 16.5717 0.5622 52.8780 20.3695 69.6444 35.8521 9.3381 7.1972 21.4612 39.0977 26.0519 27.7588 31.1559 22.2210 66.7865 37.0545 1.3963 98.9672 110.6313 14.4382 480.5514 521.5877 14.5527 351.0017 285.2609 102.1255 40.4791 700.1036 28.5186 35.7996 5.7152 17.7544 16.8049 2.2599 15.4027 3.9604 47.5491 48.7402 82.5263 11.4756 11.5968
temp: 298.150 k
press: 1.00000 atm
elementType: 17 17 8 8 8 8 8 8 8 7 7 7 7 6 6 6 6 6 6 6 6 6 6 6 6 6 6 6 6 1 1 1 1 1 1 1 1 1 1 1 1 1 1 1 1
symmnumber: 1
zpe: 844688.3 jmol-1
zpe.correction: 0.321725 hartree
zpe.thermalcorrener: 0.348466 hartree
zpe.thermalcorrenthalpy: 0.349410 hartree
zpe.thermalcorrgfe: 0.262863 hartree
zpe.sumelectzpe: -2282.855857 hartree
zpe.sumelectthermal: -2282.829116 hartree
zpe.sumelectthermalent: -2282.828172 hartree
zpe.sumelectthermalfe: -2282.914719 hartree
dipole: -4.4303 -3.1779 -1.8211
dipole: 5.7483
quadrupole: -243.7861 -200.4342 -181.2382
quadrupole: 8.5665 -5.1236 -0.5918
quadrupole: -35.2999 8.0520 27.2480 8.5665 -5.1236 -0.5918
hfenergy: -2283.1775822 hartree
pointgroup: C01 [X(C16H16Cl2N4O7)]
dipole: 1.4833753 1.3355524 -1.0632604 debye
polarizability: 307.0751611|5.1801301|409.4402409|12.8714753|-61.0219938|141.0170424 unknown
InChI: InChI=1S/C16H16Cl2N4O7/c17-5-1-7-8(2-6(5)18)22(3-9(24)12(26)13(27)10(25)4-23)14-11(19-7)15(28)21-16(29)20-14/h1-2,9-10,12-13,21,23-27H,3-4H2
charge 0 multiplicity 1
45 atoms
Cl 0.425962 4.941197 -1.30376
Cl 3.633815 5.148946 -0.711736
O  -2.879701 1.473301 -0.391287
O  -1.775548 -1.928278 0.56198
O  -3.756259 -0.466486 1.92727
O  -5.564876 0.840762 -1.02815
O  -7.863402 0.401651 0.489306
O  5.010243 -2.360656 0.812414
O  0.970005 -4.684968 0.876152
N  0.841464 -0.212247 -0.52263
N  3.605222 0.042123 0.098787
N  0.86344 -2.441549 0.215792
N  2.965047 -3.485359 0.800083
C  -2.968096 -0.013691 -0.375003
C  -1.604835 -0.550462 0.121762
C  -4.130573 -0.526477 0.505192
C  -0.548716 -0.436171 -1.00743
C  -5.406618 0.333793 0.351149
C  1.436792 1.060324 -0.561455
C  1.542321 -1.310916 -0.013591
C  -6.689772 -0.457061 0.631752
C  2.845146 1.151474 -0.254336
C  2.978821 -1.126401 0.218574
C  0.71181 2.237889 -0.876104
C  3.496194 2.41472 -0.310454
C  3.768782 -2.340015 0.629749
C  1.383762 3.469543 -0.916146
C  2.77993 3.565515 -0.644583
C  1.552172 -3.597799 0.6409
H  -3.155412 -0.28551 -1.427333
H  -1.286636 0.090576 0.975505
H  -4.319182 -1.576134 0.203065
H  -0.803682 0.38923 -1.686623
H  -0.549966 -1.381383 -1.579305
H  -5.341849 1.181277 1.065123
H  -6.692137 -0.823103 1.670453
H  -6.740642 -1.321548 -0.066051
H  -2.917029 1.778886 0.553847
H  -0.853122 -2.370623 0.504219
H  -3.115357 -1.218115 2.069304
H  -0.368134 2.223505 -1.047253
H  -4.840925 1.506482 -1.180774
H  4.564334 2.44904 -0.082596
H  3.447458 -4.343926 1.089554
H  -7.764957 0.860145 -0.386734
