program: Gaussian 09
title: 000021345
version: EM64L-G09RevD.01
frameworkgroup: C1[X(C14H12N2)]
method: RPBEPBE
basis: SDD
operation: Freq
keyword: #pfreq=noraman
keyword: PBEPBE/SDD
title: #p freq=noraman PBEPBE/SDD
converged: YES YES NO NO
title: Mulliken charges:
elementType: N N C C C C C C C C C C C C C C H H H H H H H H H H H H
charge: -0.405361 -0.002686 0.382570 0.112484 -0.674198 0.227574 -0.422730 0.441704 -0.411170 -0.346422 -0.255724 -0.218362 -0.317786 -0.495026 -0.187161 -0.343736 0.236462 0.222659 0.270826 0.306250 0.234855 0.227850 0.222039 0.222609 0.261818 0.242515 0.228094 0.240055
chargesum: 0.00000
title: Mulliken charges with hydrogens summed into heavy atoms:
elementType: N N C C C C C C C C C C C C C C
charge: -0.099111 -0.002686 0.382570 0.112484 -0.215077 0.227574 -0.151904 0.441704 -0.176315 -0.118572 -0.033685 0.004247 -0.055968 -0.252512 0.040932 -0.103681
polarizability: 2.04833764e+02 1.77436464e+01 1.53673216e+02 1.13840872e+01 -1.78284587e-01 1.11491673e+02
1716.lowfreq: -8.2532 -4.1070 -0.0010 -0.0006 -0.0002 8.4841 19.6063 24.8890 57.7658
frequency: 16.7675 24.1701 57.7588 152.4919 176.8321 211.8897 217.0938 287.6110 339.3038 394.5813 423.8314 443.9166 456.0604 513.3888 537.7508 564.0666 575.1019 581.8336 616.1866 654.5835 722.1541 732.4531 748.9851 749.9418 770.1523 787.9262 798.2526 822.7805 852.1620 866.3184 904.5142 927.9115 933.3786 955.3354 972.2074 990.9041 1004.0730 1011.8693 1027.8711 1057.1890 1094.7963 1112.6846 1132.0029 1164.8052 1182.0388 1186.1623 1218.2267 1238.4660 1254.8672 1281.9059 1300.1007 1314.9332 1346.4833 1350.6484 1391.6270 1412.8660 1422.3348 1454.7622 1460.3679 1466.9494 1482.6674 1556.7878 1561.8531 1585.2256 1586.8357 1632.6208 2968.4732 3026.9859 3104.8614 3121.9568 3127.9937 3129.2565 3142.9495 3144.0069 3162.6503 3163.8276 3221.3087 3611.4458
redmass: 4.6516 4.6004 4.8954 4.4963 4.4032 3.0778 4.0766 2.8672 6.2447 2.9278 2.8580 3.0687 3.9944 1.2877 6.1648 5.4330 3.6316 3.1709 6.9192 3.8378 2.3157 3.2432 2.9153 1.5916 3.3377 2.6164 1.7078 2.1879 1.4922 5.0116 1.5336 1.4026 1.3801 1.7055 1.2993 1.3959 3.7071 2.1391 3.4520 3.6435 1.6150 1.6486 1.4293 1.1182 1.2176 1.6329 1.7597 2.2957 1.4099 1.8014 2.5707 3.7640 1.3844 1.6214 5.4216 2.1023 2.3329 1.7037 3.9080 1.2907 3.0605 5.4858 6.1359 5.6569 6.1256 6.8903 1.0635 1.0960 1.0909 1.0856 1.0876 1.0888 1.0921 1.0946 1.1000 1.1001 1.0985 1.0809
irintensity: 2.2248 0.9539 0.2982 1.0089 1.8465 2.4869 7.9773 2.0930 0.7771 3.1274 12.8203 2.2720 2.9955 87.3191 0.4195 1.5517 5.2958 11.8552 7.7599 0.1758 22.6186 9.4908 25.8385 87.3916 15.7516 17.5589 22.8058 8.8287 0.2500 0.8674 0.4702 2.4163 3.0787 1.1312 0.0259 0.2529 11.3965 9.8225 0.3752 9.5984 35.8116 5.1811 2.3125 1.5167 1.7691 3.9234 4.2912 14.0486 4.9955 2.1141 2.3920 3.3453 8.0878 20.3765 31.7660 22.3962 3.1877 31.1205 21.1215 11.2810 1.9831 9.8560 5.2068 3.9652 0.1468 2.0814 21.7284 14.1333 27.9995 4.5800 5.9162 3.6392 26.6373 25.2584 25.8481 25.2566 0.6024 62.2861
temp: 298.150 k
press: 1.00000 atm
elementType: 7 7 6 6 6 6 6 6 6 6 6 6 6 6 6 6 1 1 1 1 1 1 1 1 1 1 1 1
symmnumber: 1
zpe: 586172.2 jmol-1
zpe.correction: 0.223261 hartree
zpe.thermalcorrener: 0.235711 hartree
zpe.thermalcorrenthalpy: 0.236655 hartree
zpe.thermalcorrgfe: 0.182109 hartree
zpe.sumelectzpe: -649.094333 hartree
zpe.sumelectthermal: -649.081884 hartree
zpe.sumelectthermalent: -649.080940 hartree
zpe.sumelectthermalfe: -649.135485 hartree
dipole: -3.4837 1.2454 -1.5538
dipole: 4.0126
quadrupole: -104.7850 -81.4947 -89.8024
quadrupole: -5.9056 3.6702 -2.5502
quadrupole: -12.7577 10.5327 2.2250 -5.9056 3.6702 -2.5502
hfenergy: -649.3175946 hartree
pointgroup: C01 [X(C14H12N2)]
dipole: -1.3459626 0.4531184 -0.6894301 debye
polarizability: 202.8770322|18.8737782|154.2795885|15.5660623|0.0460491|112.8420317 unknown
InChI: InChI=1S/C14H12N2/c1-2-6-14-13(5-1)12(10-16-14)8-11-4-3-7-15-9-11/h1-7,9-10,16H,8H2
charge 0 multiplicity 1
28 atoms
N  -2.047333 1.790573 -0.962122
N  4.461955 0.101196 0.400978
C  -0.449224 0.998424 0.472111
C  -1.511901 0.011192 0.364329
C  0.808959 0.884425 1.302373
C  -2.502713 0.535989 -0.540807
C  -0.814965 2.064895 -0.349786
C  2.009172 0.246322 0.596617
C  -1.72492 -1.266185 0.950199
C  -3.680669 -0.17187 -0.867553
C  -2.897503 -1.976418 0.629163
C  -3.864818 -1.435367 -0.270237
C  1.873072 -0.754894 -0.397515
C  3.329449 0.632347 0.948427
C  3.031158 -1.319897 -0.976306
C  4.300393 -0.867547 -0.548732
H  0.583135 0.288468 2.210624
H  1.112823 1.882521 1.671061
H  -0.28721 2.997171 -0.543871
H  -2.53871 2.413391 -1.59905
H  -0.989016 -1.693392 1.641568
H  -4.427324 0.238348 -1.556877
H  -3.075968 -2.961755 1.073789
H  -4.766885 -2.01333 -0.50001
H  0.876573 -1.075897 -0.718808
H  3.491783 1.412074 1.704855
H  2.955143 -2.094654 -1.746347
H  5.222244 -1.280731 -0.973971
