program: Gaussian 09
title: 000237984
version: EM64L-G09RevD.01
frameworkgroup: C1[X(C14H22N2O3)]
method: RPBEPBE
basis: SDD
operation: Freq
keyword: #p
keyword: freq=noraman
keyword: PBEPBE/SDD
title: #p freq=noraman PBEPBE/SDD
converged: YES YES NO NO
title: Mulliken charges:
elementType: O O O N N C C C C C C C C C C C C C C H H H H H H H H H H H H H H H H H H H H H H
charge: -0.397482 -0.319990 -0.427445 -0.215103 -0.067116 0.356621 0.147350 -0.008049 -0.466501 -0.466688 -0.461687 -0.461431 0.134095 -0.392925 -0.392934 -0.416529 -0.416522 -0.398900 -0.393992 0.210096 0.235903 0.235911 0.209942 0.202665 0.245703 0.245783 0.202540 0.233368 0.197103 0.197085 0.233178 0.247118 0.192490 0.192508 0.246680 0.192513 0.204769 0.186216 0.203163 0.380205 0.370289
chargesum: 0.00000
title: Mulliken charges with hydrogens summed into heavy atoms:
elementType: O O O N N C C C C C C C C C C C C C C
charge: -0.017277 -0.319990 -0.057156 -0.215103 -0.067116 0.356621 0.147350 -0.008049 -0.020502 -0.020836 -0.013318 -0.013108 0.134095 0.037546 0.037328 0.023079 0.022666 -0.001617 -0.004614
polarizability: 2.06955958e+02 1.06653623e-01 1.68350304e+02 -8.58698993e-03 1.55052301e-02 1.33906711e+02
1716.lowfreq: -12.6946 0.0001 0.0004 0.0007 9.9678 17.6568 34.9985 59.0245 91.2593
frequency: 30.1369 58.9403 91.2449 115.5382 118.2128 134.5646 159.6456 193.7726 215.3225 216.3916 243.8387 247.7982 262.2085 273.1542 292.0484 327.4070 335.0403 349.2540 360.9471 382.7013 396.8182 430.8442 437.4477 448.8233 463.1855 484.9646 500.3970 549.5506 556.8487 569.5494 657.5160 687.6698 745.0685 776.4414 780.2001 787.5547 823.2317 830.8330 843.2544 857.3758 882.5023 904.1125 913.2486 914.4501 932.2648 935.0068 940.7256 989.6712 999.8654 1010.0296 1051.1222 1056.2479 1057.3413 1066.1743 1102.6677 1105.0838 1125.7643 1139.4142 1147.1082 1157.3331 1160.3615 1177.9750 1181.7844 1203.1520 1255.9528 1262.4536 1268.6005 1270.0878 1274.1120 1284.6014 1309.2453 1316.3115 1317.1010 1328.7459 1338.2237 1339.4322 1343.5986 1347.5417 1351.8138 1353.5230 1356.5482 1361.8953 1458.1082 1459.8491 1461.2457 1461.6484 1462.6807 1463.2009 1465.6298 1468.6800 1472.6668 1475.2400 1479.4868 1578.2864 1624.4741 2963.5605 2965.4651 2982.6039 2983.1079 2983.8039 2985.0002 2990.9567 2992.3808 2993.9411 2996.0632 3030.1411 3031.8792 3038.8853 3042.4557 3043.6832 3048.2738 3052.4642 3059.9394 3063.3113 3068.0995 3283.4581 3563.0550
redmass: 4.5833 6.1231 3.1995 3.4882 5.5787 3.4372 3.2900 5.7095 2.7247 3.5219 2.2771 3.2442 2.8074 3.1830 6.4040 3.6900 2.5337 2.0310 2.3389 2.3558 6.5962 2.4959 1.6539 2.8591 1.2264 1.8223 1.8483 6.0230 3.5849 2.8286 6.7715 6.0964 3.2243 1.4767 3.1029 1.4657 3.1375 2.3283 2.4611 2.4349 2.3201 2.3934 2.3817 3.1208 2.3073 1.4012 1.4021 2.7760 3.3256 2.8585 1.9172 1.9461 1.8580 1.5346 1.8054 1.5677 3.2553 1.6847 1.4598 3.0100 2.8084 2.4955 1.5321 1.8829 1.3743 1.3727 1.2216 1.3408 1.2058 1.5291 1.8060 1.3061 1.3044 1.7408 1.4175 1.4131 1.4052 1.4214 1.3821 1.7187 1.5910 1.5436 1.0807 1.5330 1.1086 1.0844 1.0838 1.2081 1.0803 1.0833 1.0918 1.0992 1.1048 8.4172 9.0412 1.0629 1.0628 1.0594 1.0601 1.0621 1.0601 1.0613 1.0637 1.0618 1.0640 1.0966 1.0968 1.1013 1.1018 1.1019 1.1021 1.1033 1.1024 1.1009 1.1003 1.0640 1.0676
irintensity: 0.3177 0.2084 0.3885 0.0647 0.0594 0.1077 0.1606 0.9325 0.0429 2.1158 0.0529 5.7442 12.1141 6.4318 13.8222 5.0510 2.0450 0.3362 3.1173 12.3818 5.0145 35.0800 89.3562 0.0101 97.2809 0.3108 11.0692 1.0129 5.0659 6.8646 0.0068 11.3238 47.2552 1.3896 10.0656 0.2896 19.0295 14.0868 44.8202 7.7161 28.9792 0.1001 18.3076 5.9194 10.9248 5.1577 2.5557 28.6353 3.3603 28.7336 0.7965 0.5797 1.1542 1.1377 0.1399 0.1755 11.1026 1.5876 0.2607 46.9012 11.8553 70.3791 0.8813 0.6252 24.7620 3.1205 0.5538 38.5328 1.7088 12.1826 42.9908 0.0003 0.0911 10.1411 0.4286 1.1855 22.8777 0.3383 0.0205 11.4379 7.4332 12.8128 3.2989 42.8639 8.5240 17.9887 0.7598 21.7545 16.1664 29.1483 30.8612 7.4403 13.5871 238.5513 38.8437 38.1550 39.3266 2.6486 1.7875 51.5043 27.8425 59.0022 4.4161 120.6231 0.5729 71.7622 53.4784 41.2033 25.9153 3.5588 9.1060 0.0395 79.5347 0.1219 51.7444 32.9749 40.7104
temp: 298.150 k
press: 1.00000 atm
elementType: 8 8 8 7 7 6 6 6 6 6 6 6 6 6 6 6 6 6 6 1 1 1 1 1 1 1 1 1 1 1 1 1 1 1 1 1 1 1 1 1 1
symmnumber: 1
zpe: 911331.1 jmol-1
zpe.correction: 0.347108 hartree
zpe.thermalcorrener: 0.365189 hartree
zpe.thermalcorrenthalpy: 0.366133 hartree
zpe.thermalcorrgfe: 0.302535 hartree
zpe.sumelectzpe: -880.309572 hartree
zpe.sumelectthermal: -880.291491 hartree
zpe.sumelectthermalent: -880.290547 hartree
zpe.sumelectthermalfe: -880.354145 hartree
dipole: -1.7778 -2.9474 0.0131
dipole: 3.4421
quadrupole: -114.6555 -112.1267 -112.2170
quadrupole: -3.3053 0.0062 0.0174
quadrupole: -1.6558 0.8730 0.7827 -3.3053 0.0062 0.0174
hfenergy: -880.6566799 hartree
pointgroup: C01 [X(C14H22N2O3)]
dipole: 0.6738866 1.1739143 0.0412361 debye
polarizability: 206.9281543|0.9717502|168.3320954|-0.5461458|1.1940224|133.9527228 unknown
InChI: InChI=1S/C14H22N2O3/c17-12-13(7-3-1-4-8-13)11(15-18)14(16(12)19)9-5-2-6-10-14/h18-19H,1-10H2
charge 0 multiplicity 1
41 atoms
O  1.035426 -2.848943 -0.161531
O  -1.668107 -2.361949 -0.122732
O  -0.450352 2.934555 0.051396
N  0.482031 -1.52869 -0.109686
N  0.678528 1.984596 0.012042
C  1.380284 -0.354749 -0.074049
C  -1.150314 0.15344 -0.038078
C  0.277616 0.737449 -0.028792
C  2.258113 -0.31781 -1.363281
C  2.27588 -0.408241 1.201901
C  -1.955323 0.61513 -1.302869
C  -1.928589 0.523855 1.273237
C  -0.873535 -1.359614 -0.093933
C  3.354018 0.770495 -1.321029
C  3.373509 0.679699 1.220436
C  -3.416169 0.106233 -1.288691
C  -3.391021 0.019402 1.253851
C  4.238087 0.629189 -0.060321
C  -4.148117 0.529758 0.005752
H  1.603507 -0.182352 -2.244897
H  2.729251 -1.316047 -1.456496
H  2.746743 -1.410809 1.219023
H  1.63392 -0.333632 2.100004
H  -1.435834 0.263807 -2.215531
H  -1.943458 1.719947 -1.318104
H  -1.912879 1.624711 1.367956
H  -1.390971 0.106746 2.146919
H  2.881151 1.770564 -1.325068
H  3.971257 0.69424 -2.236937
H  4.004251 0.537146 2.119074
H  2.902336 1.677046 1.303609
H  -3.426033 -0.996793 -1.367359
H  -3.94151 0.508801 -2.176791
H  -3.897319 0.362148 2.177413
H  -3.403503 -1.086404 1.258444
H  4.786863 -0.334852 -0.099009
H  4.99828 1.433207 -0.037004
H  -4.22587 1.636671 0.044193
H  -5.181061 0.132096 0.002497
H  0.19311 -3.407591 -0.171957
H  0.023203 3.805141 0.080101
