program: Gaussian 09
title: 000021336
version: EM64L-G09RevD.01
frameworkgroup: C1[X(C11H9NO3)]
method: RPBEPBE
basis: SDD
operation: Freq
keyword: #p
keyword: freq=noraman
keyword: PBEPBE/SDD
title: #p freq=noraman PBEPBE/SDD
converged: YES YES NO NO
title: Mulliken charges:
elementType: O O O N C C C C C C C C C C C H H H H H H H H H
charge: -0.279755 -0.257985 -0.264453 -0.000918 0.006017 0.200931 0.234324 0.546320 0.097653 -0.603881 -0.196796 -0.357461 -0.476035 -0.353855 -0.507120 0.262341 0.244916 0.232659 0.239325 0.284153 0.238992 0.230817 0.241860 0.237952
chargesum: 0.00000
title: Mulliken charges with hydrogens summed into heavy atoms:
elementType: O O O N C C C C C C C C C C C
charge: -0.279755 -0.257985 -0.264453 -0.000918 0.006017 0.200931 0.234324 0.546320 0.097653 -0.341541 0.280779 -0.118136 -0.191882 -0.114863 0.203509
polarizability: 2.09565139e+02 9.71988569e-01 1.48140850e+02 -6.07840361e-01 -1.49315281e-01 6.17202409e+01
1716.lowfreq: -11.6579 -6.4949 -0.0012 -0.0009 -0.0007 3.9041 35.8356 87.1301 128.1631
frequency: 35.8011 87.1221 128.1622 134.7208 155.2519 190.8260 192.5843 252.4853 295.4877 306.1441 337.2317 392.6908 427.1611 431.4013 520.5858 557.5243 590.4632 596.0285 670.6844 686.2221 691.6136 733.5475 782.9596 819.6910 840.0928 850.0052 872.8326 901.4994 922.1900 937.6749 965.7454 984.1345 1009.4756 1035.3341 1078.5022 1110.4871 1119.2230 1135.5959 1162.1620 1181.7600 1184.6986 1261.7813 1273.0713 1330.1538 1357.9969 1368.7012 1405.8406 1416.3201 1444.1877 1453.1771 1461.8559 1463.2426 1480.4085 1483.9361 1572.0731 1613.9035 1633.7702 2993.3498 2995.3213 3099.0585 3121.8428 3132.5597 3136.5002 3154.8814 3160.1486 3181.7524
redmass: 3.0254 3.6889 2.9350 4.4949 1.9236 2.8694 2.4548 5.5867 5.3226 6.0247 4.8002 8.1073 3.7068 6.1163 7.4631 3.7568 6.5075 6.6642 6.8923 7.0342 8.8730 7.4381 2.4552 1.5788 6.5119 5.2027 1.6083 7.9824 7.8016 1.4521 1.4431 6.2832 5.0312 2.9322 1.5178 1.2517 3.5410 1.0869 1.6054 1.5269 1.7775 3.0250 2.6225 2.2493 1.6669 2.5001 2.6879 2.4148 1.5094 2.7921 1.0521 1.0554 1.5142 2.1408 6.8716 8.8636 9.0152 1.0629 1.0304 1.1046 1.1073 1.0869 1.1041 1.0939 1.0961 1.0937
irintensity: 6.5702 5.2738 8.5868 2.9585 3.3321 2.3274 2.6786 0.0357 1.0027 0.8484 5.5228 3.5085 1.6165 0.2042 3.2746 22.3634 0.9232 8.6078 2.7023 2.1191 1.2129 5.8512 0.1943 2.8811 34.9056 12.0674 77.1594 27.9191 4.0535 1.2997 1.1990 182.0623 44.4231 29.2896 13.6679 0.1574 73.1885 4.8331 43.4891 34.5970 6.6425 125.5215 72.6459 34.1083 6.5499 39.8158 7.7407 37.5907 25.0645 154.1337 15.0730 32.6866 7.7046 0.4371 89.1592 108.5896 47.3156 115.7804 62.1293 32.0367 25.6693 3.7299 18.3890 31.3295 10.8772 1.4938
temp: 298.150 k
press: 1.00000 atm
elementType: 8 8 8 7 6 6 6 6 6 6 6 6 6 6 6 1 1 1 1 1 1 1 1 1
symmnumber: 1
zpe: 468359.8 jmol-1
zpe.correction: 0.178389 hartree
zpe.thermalcorrener: 0.190648 hartree
zpe.thermalcorrenthalpy: 0.191593 hartree
zpe.thermalcorrgfe: 0.139374 hartree
zpe.sumelectzpe: -703.884076 hartree
zpe.sumelectthermal: -703.871816 hartree
zpe.sumelectthermalent: -703.870872 hartree
zpe.sumelectthermalfe: -703.923091 hartree
dipole: -4.8532 -0.8484 0.6589
dipole: 4.9707
quadrupole: -83.4337 -80.2894 -88.2673
quadrupole: -11.4006 -1.9478 -0.2816
quadrupole: 0.5631 3.7074 -4.2705 -11.4006 -1.9478 -0.2816
hfenergy: -704.0624649 hartree
pointgroup: C01 [X(C11H9N1O3)]
dipole: 1.9396536 0.1793756 0.1732969 debye
dipolederiv: -1.4547911 -0.2204174 0.0053388 0.017982 -0.4279875 -0.0435792 0.1271965 0.0078326 -0.24664 -1.5096658 -0.0973187 0.0023617 -0.275829 -0.4882235 0.0156372 0.1022988 0.0052175 -0.2785217 -0.4225683 0.3113827 0.0228481 0.4767984 -1.5904703 -0.1065245 0.0373877 -0.1304197 -0.2860451 -0.5640708 0.0507011 0.0174333 0.0117483 -0.2970065 -0.0007871 0.0223245 -0.0063411 -0.2594154 0.9731978 -0.2192561 -0.1057581 -0.3383132 -0.4760904 -0.0324046 -0.1678238 -0.0828704 -0.056197 -0.1231196 0.0437187 0.0035333 -0.2484468 -0.3764437 -0.0064134 -0.0035932 -0.025262 0.0060344 1.2090522 0.1283922 -0.0680698 0.4916089 0.4885552 0.0213351 -0.0957003 0.0433545 0.0933402 0.3995834 0.048411 -0.0216628 0.3301068 0.0300878 -0.0247087 0.0117091 0.001573 0.0720098 -0.0223917 0.1615203 0.0216984 -0.3551514 1.5148594 0.124749 -0.0314008 0.1196549 0.1113753 -0.5789103 0.0268338 0.0276662 0.0205485 -0.05344 0.0094934 0.0123844 0.0126889 -0.2416193 1.2100743 0.1013073 0.111468 0.0476949 0.6369702 0.0152361 0.1421064 0.028687 0.6095647 -0.2509109 0.0162848 0.0085842 -0.1214211 0.0869074 0.021371 -0.0041948 0.0116422 -0.1413014 0.3471711 0.0541855 -0.0178161 0.111474 0.2330977 0.0114445 -0.0223813 0.0174888 -0.0533854 0.2956249 -0.1843109 -0.0367624 -0.0272485 0.1674595 0.0159743 -0.0268037 0.0284817 -0.1017766 0.4869466 -0.4946081 -0.0249908 -0.217164 0.5995474 0.0189576 -0.0062231 0.0237281 0.304779 0.0791803 0.0316471 0.0094121 -0.0169681 -0.0256867 -0.012439 0.000536 -0.0225777 0.188313 -0.1054418 -0.0299012 0.0517741 -0.0205186 0.0735934 0.0094474 0.1055111 0.0152697 0.0048312 -0.0608325 -0.0111519 -0.0419226 0.0163377 0.0253535 0.0125941 -0.2213976 -0.0212641 -0.139974 0.0831564 -0.0233936 0.0032582 0.0580239 -0.1072474 -0.0195073 0.007447 -0.0153214 0.1550775 0.1065516 0.0204942 0.0036701 0.0085525 -0.0311674 -0.0094392 0.0015918 -0.0119111 0.1280432 -0.0965329 0.1076858 0.0210124 0.085094 0.0418157 -0.0115692 0.0207944 -0.0126961 0.1460522 -0.034141 0.127919 -0.0673054 -0.0239575 0.0617448 -0.0654316 -0.0964796 -0.0028671 -0.0863455 -0.0306064 0.1121984 0.08108 -0.0378125 0.0640916 0.0775248 0.085514 0.0317186 -0.0497878 0.0634445 -0.0623241 -0.0068508 0.0068606 -0.1503204 -0.0209607 -0.0008035 -0.0158067 0.1215888 unknown
polarizability: 209.0527185|-3.1692816|147.9548251|-7.0429769|5.7559707|62.4186855 unknown
InChI: InChI=1S/C11H9NO3/c1-13-10-8-5-12-3-2-7(8)4-9-11(10)15-6-14-9/h2-5H,6H2,1H3
charge 0 multiplicity 1
24 atoms
O  2.73326 -0.4936 -0.421102
O  2.50213 1.870575 -0.229793
O  0.216682 -2.374427 -0.353141
N  -3.503453 -0.583438 0.021058
C  1.355182 -0.152013 -0.250106
C  -1.057771 -0.34714 -0.119572
C  1.223575 1.267769 -0.148533
C  -1.163403 1.095805 -0.021597
C  0.239549 -0.987552 -0.243026
C  0.012419 1.922132 -0.038457
C  3.470788 0.75627 -0.117383
C  -2.481313 1.643227 0.094955
C  -2.266447 -1.116813 -0.089647
C  -3.591025 0.794298 0.111031
C  1.492028 -3.116231 -0.38417
H  -0.05412 3.009966 0.032107
H  4.264616 0.891764 -0.866091
H  3.852109 0.712984 0.921354
H  -2.614931 2.727582 0.170521
H  -2.207121 -2.206737 -0.160028
H  -4.606963 1.194216 0.19801
H  2.066023 -2.947698 0.543634
H  2.101134 -2.819732 -1.254487
H  1.195153 -4.172105 -0.463635
