program: Gaussian 09
title: 000237967
version: EM64L-G09RevD.01
frameworkgroup: C1[X(C10H14N2O)]
method: RPBEPBE
basis: SDD
operation: Freq
keyword: #p
keyword: freq=noraman
keyword: PBEPBE/SDD
title: #p freq=noraman PBEPBE/SDD
converged: YES YES NO NO
title: Mulliken charges:
elementType: O N N C C C C C C C C C C H H H H H H H H H H H H H H
charge: -0.277369 -0.374421 -0.576196 -0.517237 0.485491 -0.502479 0.253568 -0.379463 -0.443819 -0.369131 -0.217107 -0.224467 -0.241515 0.224693 0.266850 0.222262 0.223323 0.300796 0.233055 0.210324 0.231204 0.247196 0.226547 0.226693 0.229413 0.262863 0.278925
chargesum: 0.00000
title: Mulliken charges with hydrogens summed into heavy atoms:
elementType: O N N C C C C C C C C C C
charge: -0.277369 -0.073624 -0.034408 -0.025695 0.485491 -0.056894 0.253568 0.063916 -0.212615 -0.121935 0.009440 0.002227 -0.012102
polarizability: 1.71919363e+02 4.78158457e-01 1.12910334e+02 -1.28650654e+01 8.22086891e+00 8.47169535e+01
1716.lowfreq: -0.0005 0.0004 0.0006 4.6385 5.4340 12.0095 25.3471 32.1626 41.9071
frequency: 25.1666 32.0352 41.8790 59.1999 92.5552 152.3690 210.6858 218.2933 224.5139 277.7007 310.9595 374.4413 403.4584 437.6615 496.2260 559.5630 604.9935 609.4714 617.2228 625.0160 705.0324 711.7266 754.7235 791.9936 809.9363 855.0351 883.3304 917.6014 953.6890 977.7011 990.0873 995.5863 1006.6686 1016.7153 1026.7055 1076.4202 1088.7306 1105.0264 1120.8531 1172.2906 1186.6428 1204.9406 1213.3773 1231.6678 1267.2142 1288.4320 1310.2915 1323.5878 1353.7293 1381.4751 1386.6480 1441.1944 1449.2511 1471.4352 1480.6399 1487.1562 1494.6824 1595.2603 1609.0683 1615.4215 1640.5957 2938.0671 2982.2672 2987.6699 3027.8185 3038.7794 3061.0168 3114.3782 3123.4718 3135.3000 3146.2252 3163.2516 3454.6845 3552.7388 3582.5206
redmass: 4.2658 3.7706 4.5841 3.2688 2.3692 4.0950 1.2699 3.6339 4.3240 3.2022 2.6179 3.4976 2.8051 2.7360 3.7903 1.9002 2.9269 1.6960 3.4677 1.7699 1.9213 4.2492 1.7902 1.2323 3.7679 1.2485 2.8347 1.4372 1.8306 1.3940 6.0696 1.3320 2.4370 2.2325 2.1751 3.1742 1.7403 2.9002 1.4114 1.0541 1.1134 1.5078 2.4682 1.2634 1.4804 1.1845 1.3024 1.3945 1.4567 1.3813 5.5416 2.1420 1.1127 1.2448 2.0366 1.8040 1.0845 6.0555 6.2575 6.0154 1.0941 1.0673 1.0605 1.0611 1.0927 1.1006 1.1026 1.0873 1.0860 1.0913 1.0962 1.1015 1.0452 1.0779 1.0973
irintensity: 0.9916 0.8520 3.3221 3.4476 6.9820 0.8863 31.7887 12.1735 24.8189 21.5500 6.1597 6.9763 0.4764 3.6886 19.8215 42.9258 58.0868 100.5784 51.3675 116.7143 46.2259 5.5043 47.8033 3.8878 6.9888 0.0563 9.4010 2.2952 0.4108 0.1351 0.1365 0.6590 4.0770 3.6902 12.7310 18.3150 8.4913 39.0228 37.7340 0.1139 1.2712 16.4402 2.2786 59.3322 30.0981 2.7337 6.9684 38.1490 7.9392 25.8915 3.3233 25.6209 15.4297 71.4795 134.8217 68.1349 4.3841 0.4437 172.9537 6.9248 35.3596 48.2868 39.8582 17.3964 19.6387 14.5340 44.6168 9.2608 0.8917 13.2701 41.1908 22.2477 0.7332 16.4563 0.5122
temp: 298.150 k
press: 1.00000 atm
elementType: 8 7 7 6 6 6 6 6 6 6 6 6 6 1 1 1 1 1 1 1 1 1 1 1 1 1 1
symmnumber: 1
zpe: 592595.1 jmol-1
zpe.correction: 0.225708 hartree
zpe.thermalcorrener: 0.238951 hartree
zpe.thermalcorrenthalpy: 0.239896 hartree
zpe.thermalcorrgfe: 0.183450 hartree
zpe.sumelectzpe: -573.217819 hartree
zpe.sumelectthermal: -573.204575 hartree
zpe.sumelectthermalent: -573.203631 hartree
zpe.sumelectthermalfe: -573.260077 hartree
dipole: 0.2141 0.3031 -2.5254
dipole: 2.5526
quadrupole: -62.8602 -71.1728 -87.2823
quadrupole: -1.5582 -0.4256 5.4902
quadrupole: 10.9116 2.5990 -13.5106 -1.5582 -0.4256 5.4902
hfenergy: -573.4435268 hartree
pointgroup: C01 [X(C10H14N2O1)]
dipole: -0.0502873 0.2306655 -0.9761105 debye
polarizability: 170.826473|-6.2876624|115.3092977|14.585001|2.0986734|83.4108803 unknown
InChI: InChI=1S/C10H14N2O/c11-7-6-10(13)12-8-9-4-2-1-3-5-9/h1-5,12H,6-8,11H2
charge 0 multiplicity 1
27 atoms
O  1.914727 -0.237321 1.726119
N  0.796292 0.581913 -0.145217
N  5.415914 -0.544622 -0.899042
C  -0.362996 1.087148 0.610471
C  -1.687056 0.490938 0.144459
C  2.976895 -0.528175 -0.468963
C  1.864608 -0.05839 0.468256
C  4.363379 -0.008644 -0.012351
C  -2.783706 1.329404 -0.17256
C  -1.848056 -0.915476 0.045168
C  -4.021318 0.777118 -0.577562
C  -3.081245 -1.469522 -0.36057
C  -4.173309 -0.624555 -0.673367
H  -0.404736 2.192112 0.546339
H  -0.156138 0.822818 1.665343
H  2.992298 -1.6362 -0.443918
H  2.805656 -0.223909 -1.517648
H  0.79618 0.684865 -1.161424
H  4.485625 -0.26229 1.063773
H  4.38006 1.094698 -0.090429
H  -2.670456 2.418737 -0.101266
H  -1.004593 -1.570898 0.292745
H  -4.86138 1.437981 -0.819493
H  -3.194715 -2.557462 -0.428724
H  -5.1307 -1.054924 -0.987819
H  5.544097 -1.55926 -0.822391
H  6.308274 -0.045082 -0.84273
