program: Gaussian 09
title: 000237970
version: EM64L-G09RevD.01
frameworkgroup: C1[X(C15H12N2O2S2)]
method: RPBEPBE
basis: SDD
operation: Freq
keyword: #p
keyword: freq=noraman
keyword: PBEPBE/SDD
title: #p freq=noraman PBEPBE/SDD
converged: YES YES NO NO
title: Mulliken charges:
elementType: S S O O N N C C C C C C C C C C C C C C C H H H H H H H H H H H H
charge: 0.308940 0.228320 -0.299569 -0.189693 -0.398510 -0.116398 -0.378658 0.439815 0.319481 0.185728 -0.278237 -0.334225 -0.445215 -0.317153 -0.317952 -0.238427 -0.208008 -0.242507 -0.246748 -0.072217 -0.544168 0.249152 0.262156 0.294237 0.467856 0.240994 0.234223 0.232771 0.230358 0.227647 0.234115 0.222967 0.248923
chargesum: 0.00000
title: Mulliken charges with hydrogens summed into heavy atoms:
elementType: S S O O N N C C C C C C C C C C C C C C C
charge: 0.308940 0.228320 -0.299569 -0.189693 0.069347 -0.116398 -0.378658 0.439815 0.319481 0.185728 -0.029085 -0.072069 -0.445215 -0.022916 -0.076957 -0.004204 0.024763 -0.012149 -0.019100 -0.072217 0.161836
polarizability: 3.35435672e+02 2.04940905e+01 2.69899638e+02 1.11794851e+01 -5.12090940e+00 8.85666317e+01
1716.lowfreq: -5.4030 -2.4649 -0.0022 -0.0012 0.0012 5.3694 22.7534 34.4770 50.5011
frequency: 22.7029 34.4650 50.4950 63.1608 88.6064 99.2495 109.2555 117.1780 168.8630 183.4667 196.8174 222.6764 252.9903 281.1655 288.2643 308.6033 316.9229 321.3666 379.9674 411.6408 432.6590 459.2790 485.5516 487.4256 508.1741 523.7087 551.0287 575.5818 577.5958 590.2150 607.4203 629.9750 680.7805 716.1101 731.6663 733.2982 754.0912 764.7070 791.9336 823.0051 843.7899 849.9544 864.9000 926.6231 934.6387 947.8899 977.3608 984.7020 986.7632 995.5230 1016.0432 1042.4049 1048.9150 1092.7347 1114.3583 1117.6514 1142.4217 1153.7540 1169.9105 1178.4978 1205.8223 1230.7318 1261.0013 1273.6899 1296.0575 1378.0072 1386.5569 1428.8886 1430.8338 1443.2620 1446.6801 1456.4895 1471.1674 1472.8073 1491.7181 1562.5996 1570.7660 1599.8483 1604.2014 1617.3805 1711.1341 2919.3463 2963.7682 3053.6609 3124.1160 3138.0823 3138.3491 3153.0187 3156.4840 3169.5999 3171.4251 3182.6573 3192.6895
redmass: 5.8130 5.4756 7.7698 7.6300 4.5239 4.2153 6.3982 5.7462 8.0555 4.3011 3.7392 4.0926 1.4665 10.5489 6.6642 4.7075 3.9552 9.5231 12.0764 14.6770 3.1872 3.3748 6.1955 8.3712 6.4286 6.1298 4.2919 6.9522 4.8945 8.6165 8.5363 9.3489 7.4239 6.1313 3.6766 2.8492 1.2657 1.5263 6.3502 4.9438 6.8227 1.4524 1.3643 10.0027 1.3599 1.3812 1.3089 1.3250 8.1301 1.1334 2.1993 5.3576 2.1344 3.5306 1.2617 1.4983 2.3141 1.4705 1.1208 1.0642 2.6609 2.9705 2.2964 1.6269 1.6849 5.1299 8.7152 1.5686 2.5563 2.6555 1.7378 8.4221 1.0661 1.1212 2.1950 2.0105 5.7928 6.9006 6.4999 2.7911 8.2531 1.0932 1.0327 1.1041 1.0999 1.0861 1.0859 1.0910 1.0914 1.0969 1.0971 1.0971 1.0954
irintensity: 0.2032 0.3348 0.5650 0.5589 3.5031 1.5955 0.3303 3.2213 12.9984 0.0994 3.4876 8.4070 2.8910 0.4242 0.1823 1.4830 0.9489 2.9910 1.0212 27.6421 6.1875 8.3006 2.1206 0.3879 2.3387 71.9219 3.0123 4.5577 1.0682 9.8344 3.8588 19.9764 3.5504 37.3796 0.8543 18.6681 103.6353 74.2746 113.1169 5.3484 0.2014 1.0756 0.4058 208.2469 3.6139 3.3090 0.3037 2.1368 41.6054 78.7217 7.2151 14.4301 13.8375 140.2552 0.2235 6.2883 93.6194 10.1919 0.5608 0.5737 44.5027 13.1252 123.5497 22.8707 37.7991 6.9514 6.3768 1.4829 60.0155 16.7459 25.0719 130.0488 20.8092 55.4286 78.1442 325.6250 25.3251 10.1213 16.8027 186.9462 314.3583 801.4059 57.3901 37.7503 20.8102 2.4937 1.4363 8.9885 21.6113 19.7877 18.1464 9.5662 2.5300
temp: 298.150 k
press: 1.00000 atm
elementType: 16 16 8 8 7 7 6 6 6 6 6 6 6 6 6 6 6 6 6 6 6 1 1 1 1 1 1 1 1 1 1 1 1
symmnumber: 1
zpe: 624652.5 jmol-1
zpe.correction: 0.237918 hartree
zpe.thermalcorrener: 0.256627 hartree
zpe.thermalcorrenthalpy: 0.257571 hartree
zpe.thermalcorrgfe: 0.189356 hartree
zpe.sumelectzpe: -1633.402851 hartree
zpe.sumelectthermal: -1633.384142 hartree
zpe.sumelectthermalent: -1633.383197 hartree
zpe.sumelectthermalfe: -1633.451413 hartree
dipole: 1.7045 6.4953 0.3441
dipole: 6.7240
quadrupole: -116.4994 -129.9782 -141.7922
quadrupole: -6.0955 0.2173 2.2525
quadrupole: 12.9238 -0.5549 -12.3689 -6.0955 0.2173 2.2525
hfenergy: -1633.6407689 hartree
pointgroup: C01 [X(C15H12N2O2S2)]
dipole: 0.5634384 -1.2848044 -2.2427878 debye
polarizability: 326.7384013|22.5305091|153.7703413|-43.4321368|82.5271797|213.3931991 unknown
InChI: InChI=1S/C15H12N2O2S2/c1-19-12-8-4-2-6-10(12)16-14(18)21-15-17-11-7-3-5-9-13(11)20-15/h2-9,16H,1H3
charge 0 multiplicity 1
33 atoms
S  3.535109 1.702917 1.327716
S  0.694794 2.060386 2.6024
O  -1.362141 -0.585933 -1.186424
O  -1.942772 1.751694 3.17336
N  -1.276044 0.543442 1.240889
N  1.352211 0.370644 0.496951
C  3.683006 0.500045 -0.029159
C  2.410821 -0.096706 -0.306792
C  -2.523323 -0.021783 0.830069
C  -2.567534 -0.630379 -0.462921
C  4.838844 0.139175 -0.746557
C  2.303059 -1.086633 -1.310319
C  1.741505 1.270075 1.381168
C  -3.697948 -0.003311 1.61967
C  -3.761121 -1.212977 -0.939436
C  4.712521 -0.844521 -1.75461
C  3.458587 -1.453383 -2.028525
C  -4.890995 -0.586862 1.136778
C  -4.924939 -1.19207 -0.136106
C  -1.120982 1.353694 2.32396
C  -1.398693 -1.017058 -2.586395
H  5.809814 0.596902 -0.53521
H  1.332634 -1.556435 -1.491012
H  -3.675167 0.476098 2.600092
H  -0.411274 0.314182 0.676423
H  -3.7929 -1.679882 -1.928128
H  5.598072 -1.143342 -2.325288
H  3.392235 -2.222461 -2.805498
H  -5.790029 -0.56316 1.760885
H  -5.848677 -1.64535 -0.510896
H  -2.162623 -0.453412 -3.154988
H  -1.598984 -2.103081 -2.668088
H  -0.399563 -0.788716 -2.985508
