program: Gaussian 09
title: 000237948
version: EM64L-G09RevD.01
frameworkgroup: C1[X(C10H15NO2)]
method: RPBEPBE
basis: SDD
operation: Freq
keyword: #p
keyword: freq=noraman
keyword: PBEPBE/SDD
title: #p freq=noraman PBEPBE/SDD
converged: NO YES NO NO
title: Mulliken charges:
elementType: O O N C C C C C C C C C C H H H H H H H H H H H H H H H
charge: -0.288730 -0.257034 -0.184355 -0.343413 -0.385524 -0.351877 -0.271163 -0.691307 0.337790 -0.169952 -0.185912 -0.286404 -0.281905 0.190979 0.190912 0.211925 0.211877 0.197695 0.197731 0.230902 0.230766 0.210935 0.210906 0.219240 0.280719 0.281069 0.247460 0.246671
chargesum: 0.00000
title: Mulliken charges with hydrogens summed into heavy atoms:
elementType: O O N C C C C C C C C C C
charge: -0.288730 -0.257034 -0.184355 0.038478 0.038278 0.043549 0.190505 -0.050226 0.337790 0.110767 0.095157 -0.038944 -0.035234
polarizability: 1.72737313e+02 8.58078060e+00 1.19436357e+02 9.15470352e-02 -5.29056315e-02 7.22754619e+01
1716.lowfreq: -37.6527 -6.0929 -3.1969 -0.0006 0.0004 0.0004 16.6459 30.2253 49.7146
frequency: -25.6338 29.8225 49.6676 74.0954 97.2026 105.8970 137.6212 143.0648 204.4373 221.8512 239.8195 253.5575 343.7308 435.7584 446.6915 541.1055 591.9191 603.6571 709.2804 724.9114 727.7877 751.4378 763.5757 771.0318 842.5032 856.6145 865.9900 876.5196 897.6527 910.4109 942.7823 963.8880 1018.9726 1034.3567 1065.0984 1069.8000 1076.8104 1088.2718 1124.8553 1127.4913 1151.6339 1203.5248 1250.1318 1253.2687 1257.8179 1281.5601 1290.0877 1290.4193 1310.1413 1320.7877 1353.0504 1377.3709 1391.9658 1403.1666 1465.0404 1466.1278 1472.8858 1474.9025 1479.3337 1483.7616 1489.5498 1539.5534 1647.8918 2957.0927 2969.1392 2973.2013 2989.8035 2997.0739 3004.4065 3024.3060 3046.6806 3069.5639 3073.6351 3079.3215 3210.9057 3225.9933 3256.1088 3269.1160
redmass: 1.8862 3.2292 4.3809 2.8863 2.2435 3.4905 3.8710 3.0241 4.8969 5.4897 1.0897 4.0720 4.0507 3.7405 4.5524 5.9359 3.5681 2.9817 6.8450 1.2984 1.0706 1.2602 1.1101 8.8359 1.1787 5.8750 1.3114 3.1281 1.3530 2.7360 3.4085 1.1564 3.3468 2.1045 1.3327 2.2614 2.4587 1.3066 4.8093 2.6021 1.5008 1.4143 1.3216 1.3039 1.2175 1.0919 3.1854 1.0919 3.1619 1.7245 1.5875 1.6458 1.2225 3.4983 1.0687 1.0854 2.5930 1.2690 1.0422 1.0767 1.0921 4.7204 11.9806 1.0586 1.0591 1.0364 1.0595 1.0990 1.0565 1.1029 1.1041 1.1011 1.0993 1.1084 1.0909 1.0964 1.1026 1.1067
irintensity: 0.5431 0.0186 0.1732 0.3368 1.7101 0.0324 0.3007 0.6806 2.5434 7.4376 0.0050 1.0965 8.1087 9.2317 1.8158 0.4841 7.8714 0.1237 38.0272 4.9912 10.0297 147.4942 0.1953 3.9586 0.9852 2.6040 1.1461 0.6687 0.0217 19.6669 127.6914 1.1728 1.8166 50.3015 67.3334 36.5879 12.7481 17.3118 342.5618 5.4214 0.5995 0.6549 1.4205 2.3465 0.0020 0.2072 292.6239 0.7164 122.2653 161.4828 1.9706 13.2398 12.9551 53.4944 0.4297 0.2014 100.2092 15.9322 13.0725 3.2818 28.1780 3.1738 327.2482 6.9990 52.3035 35.1268 21.3001 0.8545 36.5211 17.1629 13.2852 58.0231 49.1436 82.3589 7.2338 1.2070 2.3180 4.8661
temp: 298.150 k
press: 1.00000 atm
elementType: 8 8 7 6 6 6 6 6 6 6 6 6 6 1 1 1 1 1 1 1 1 1 1 1 1 1 1 1
symmnumber: 1
zpe: 613267.2 jmol-1
zpe.correction: 0.233581 hartree
zpe.thermalcorrener: 0.246651 hartree
zpe.thermalcorrenthalpy: 0.247595 hartree
zpe.thermalcorrgfe: 0.192293 hartree
zpe.sumelectzpe: -594.256407 hartree
zpe.sumelectthermal: -594.243337 hartree
zpe.sumelectthermalent: -594.242392 hartree
zpe.sumelectthermalfe: -594.297694 hartree
dipole: 2.1817 -1.5059 0.0042
dipole: 2.6509
quadrupole: -70.3439 -81.3442 -80.2663
quadrupole: 2.6710 0.0178 -0.0089
quadrupole: 6.9743 -4.0261 -2.9482 2.6710 0.0178 -0.0089
hfenergy: -594.4899878 hartree
pointgroup: C01 [X(C10H15N1O2)]
dipole: -0.8553786 -0.5967245 0.0014887 debye
polarizability: 172.8213368|-8.315514|119.3523278|-0.0291093|-0.0838194|72.2754677 unknown
InChI: InChI=1S/C10H15NO2/c1-2-3-6-9-13-10(12)11-7-4-5-8-11/h4-5,7-8H,2-3,6,9H2,1H3
charge 0 multiplicity 1
28 atoms
O  0.019691 0.013479 -0.004399
O  1.084542 2.104097 -0.008051
N  2.318895 0.09766 -0.004561
C  -3.801614 0.231786 0.002074
C  -2.379181 -0.375917 0.002643
C  -4.909449 -0.846234 0.01273
C  -1.304861 0.709784 -0.006159
C  -6.330254 -0.243122 0.012263
C  1.125853 0.854057 -0.006347
C  3.606241 0.681077 -0.00427
C  2.444875 -1.311088 -0.002814
C  4.534241 -0.352184 -0.002474
C  3.802225 -1.607595 -0.001681
H  -3.932038 0.878261 -0.890708
H  -3.927237 0.89087 0.886309
H  -2.247662 -1.025844 -0.883867
H  -2.243684 -1.014865 0.896498
H  -4.785117 -1.505204 -0.870529
H  -4.780227 -1.492532 0.904582
H  -1.35626 1.360201 0.886486
H  -1.359521 1.349061 -0.906621
H  -6.491505 0.394985 0.901677
H  -6.495638 0.383652 -0.88443
H  -7.103457 -1.032992 0.019074
H  3.714049 1.762531 -0.005331
H  1.561621 -1.942183 -0.002755
H  5.616623 -0.233292 -0.001832
H  4.232451 -2.608052 -0.000407
