program: Gaussian 09
title: 000237946
version: EM64L-G09RevD.01
frameworkgroup: C1[X(C5H6N2O)]
method: RPBEPBE
basis: SDD
operation: Freq
keyword: #pfreq=noraman
keyword: PBEPBE/SDD
title: #p freq=noraman PBEPBE/SDD
converged: NO NO NO NO
title: Mulliken charges:
elementType: O N N C C C C C H H H H H H
charge: -0.272139 -0.181991 -0.644321 -0.149150 -0.171054 -0.291344 -0.285679 0.310814 0.287707 0.223813 0.247970 0.246180 0.352292 0.326902
chargesum: 0.00000
title: Mulliken charges with hydrogens summed into heavy atoms:
elementType: O N N C C C C C
charge: -0.272139 -0.181991 0.034872 0.138558 0.052760 -0.043374 -0.039499 0.310814
polarizability: 9.36836466e+01 2.94136168e-02 7.50612737e+01 5.66711663e-03 1.59186492e-03 2.94321654e+01
1716.lowfreq: -38.4797 -10.1519 -0.0003 0.0006 0.0008 2.1389 2.6638 163.0860 241.1612
frequency: -38.1262 163.0860 241.1611 414.8417 416.2021 504.4741 544.2335 600.8951 604.1626 644.7713 665.3528 722.8370 752.4277 850.0902 858.2929 894.2355 930.6105 1042.0673 1047.8854 1079.4246 1099.3686 1194.0077 1255.0363 1308.4118 1365.9688 1412.0771 1470.9132 1533.2836 1599.8988 1671.1422 3209.4082 3224.8079 3240.7147 3262.2519 3554.8823 3704.3405
redmass: 3.1956 5.0126 4.5826 1.2772 3.7549 4.6278 1.2516 2.6757 2.4898 3.8942 1.4199 6.0009 1.3018 1.3331 5.8207 1.3525 2.9394 2.0123 1.5516 1.3552 1.2789 4.4375 1.3513 4.7576 3.8132 3.9952 3.9175 4.7176 1.3987 4.0526 1.0889 1.0946 1.1042 1.1072 1.0451 1.1045
irintensity: 13.0118 0.2065 10.8177 54.6620 5.2384 0.3657 203.1222 0.1328 2.2572 27.6020 87.1048 80.6049 99.7145 0.6497 0.8039 0.8960 18.6649 1.6922 31.4227 19.8714 55.0647 3.5819 0.6281 0.1626 458.7049 130.9271 66.5395 0.7478 153.4035 334.2533 3.5405 5.8894 1.2299 5.3530 50.3168 44.1784
temp: 298.150 k
press: 1.00000 atm
elementType: 8 7 7 6 6 6 6 6 1 1 1 1 1 1
symmnumber: 1
zpe: 281622.3 jmol-1
zpe.correction: 0.107264 hartree
zpe.thermalcorrener: 0.113417 hartree
zpe.thermalcorrenthalpy: 0.114361 hartree
zpe.thermalcorrgfe: 0.077096 hartree
zpe.sumelectzpe: -378.279072 hartree
zpe.sumelectthermal: -378.272919 hartree
zpe.sumelectthermalent: -378.271975 hartree
zpe.sumelectthermalfe: -378.309240 hartree
dipole: -0.0678 3.7984 -0.0013
dipole: 3.7990
quadrupole: -41.8102 -41.8589 -50.9655
quadrupole: -9.1615 0.0128 -0.0185
quadrupole: 3.0680 3.0193 -6.0873 -9.1615 0.0128 -0.0185
hfenergy: -378.3863359 hartree
pointgroup: C01 [X(C5H6N2O1)]
dipole: -0.0319772 1.4942976 0.0002163 debye
dipolederiv: -0.9085896 0.2377335 0.0011039 0.3173092 -0.9126919 -0.0023393 -0.0027675 0.0029945 -0.379678 -1.7668038 -0.027257 0.0003308 0.0158331 -0.1609227 0.0002764 0.0026909 -0.0000671 -0.0395133 -0.7160973 -0.4058916 0.0018864 -0.5427115 -0.8995372 0.0009909 0.0005852 -0.0009252 -0.7323474 0.4994096 0.1025791 -0.0007252 0.3833132 -0.0638863 -0.0005628 -0.0006101 -0.0000578 -0.1605279 0.4330339 -0.1423219 -0.0006582 -0.337819 -0.1037127 0.0005247 -0.000258 -0.0000411 -0.2276857 -0.2698942 0.0730328 -0.0000983 0.2601927 0.0177873 -0.000434 0.0002623 -0.0001852 -0.2346769 -0.2515123 -0.0138409 -0.000093 -0.2411327 0.098101 0.0001866 0.000361 -0.0000474 -0.22023 2.3720642 0.1111234 -0.0008245 0.1103472 1.5557878 0.0021339 0.0020824 -0.0001186 0.3479316 0.1060403 0.0511153 0.0001658 0.0065288 0.0714987 0.0000899 0.0001057 -0.0000352 0.2220322 0.0476347 -0.1024742 0.0001951 -0.0612905 -0.0223693 -0.0000142 0.0001639 0.0001628 0.2299076 0.0074409 -0.0873586 0.0001708 -0.085706 0.0356839 0.0002217 -0.0000297 0.0001846 0.2011098 -0.0031812 0.0910859 0.000132 0.0878426 0.038635 -0.0001182 -0.0000318 -0.0000782 0.1993365 0.2341588 0.0404104 -0.0006093 0.0198098 0.1927701 -0.0004733 -0.0011954 -0.0007694 0.3997139 0.2162961 0.0720638 -0.0009763 0.067483 0.1528564 -0.0004824 -0.0013588 -0.0010167 0.3946277 unknown
polarizability: 93.6572808|0.7008337|75.0876374|-0.0041162|-0.0105202|29.4321675 unknown
InChI: InChI=1S/C5H6N2O/c6-5(8)7-3-1-2-4-7/h1-4H,6H2
charge 0 multiplicity 1
14 atoms
O  2.081422 -1.146353 0.001134
N  0.045481 0.029943 -0.002626
N  2.12929 1.178404 -0.000085
C  -0.757932 -1.128019 -0.000128
C  -0.795116 1.165607 -0.000689
C  -2.089703 -0.727377 0.000762
C  -2.113892 0.720989 0.00019
C  1.479129 -0.040218 -0.005013
H  -0.288727 -2.108034 -0.000177
H  -0.411288 2.183329 -0.00097
H  -2.951567 -1.391939 0.001828
H  -2.99592 1.359538 0.000827
H  3.146163 1.153115 0.004259
H  1.65436 2.076715 0.000492
