program: Gaussian 09
title: 000226448
version: EM64L-G09RevD.01
frameworkgroup: C1[X(C12H8O2S2)]
method: RPBEPBE
basis: SDD
operation: Freq
keyword: #p
keyword: freq=noraman
keyword: PBEPBE/SDD
title: #p freq=noraman PBEPBE/SDD
converged: NO NO NO NO
title: Mulliken charges:
elementType: S S O O C C C C C C C C C C C C H H H H H H H H
charge: 0.672093 0.672097 -0.590110 -0.590115 -0.146753 -0.146745 -0.146739 -0.146744 -0.215814 -0.215821 -0.215825 -0.215816 -0.216775 -0.216775 -0.216774 -0.216776 0.295088 0.295085 0.295086 0.295087 0.243262 0.243262 0.243261 0.243262
chargesum: 0.00000
title: Mulliken charges with hydrogens summed into heavy atoms:
elementType: S S O O C C C C C C C C C C C C
charge: 0.672093 0.672097 -0.590110 -0.590115 -0.146753 -0.146745 -0.146739 -0.146744 0.079274 0.079264 0.079261 0.079270 0.026487 0.026487 0.026487 0.026485
polarizability: 2.07982166e+02 -1.04920846e-05 1.96882885e+02 1.04762478e-04 4.74630181e-03 9.99361407e+01
1716.lowfreq: -8.5560 -4.1308 -3.5407 -0.0023 -0.0014 0.0026 52.7852 113.1033 127.8812
frequency: 52.7852 113.1029 127.8812 134.0646 158.5950 167.1307 169.7975 219.0226 261.7807 283.5919 294.7139 333.7720 389.7608 404.0930 430.7122 432.4214 433.6499 497.3628 498.0107 542.1933 614.9811 627.6653 662.7109 674.7652 703.1264 727.0509 771.2209 778.5559 816.4677 818.8589 888.6607 892.8381 962.9646 963.8424 965.2362 983.8105 1000.8866 1001.8737 1013.5767 1016.1624 1042.1546 1074.5560 1114.9536 1120.0240 1167.8828 1168.2204 1238.6167 1243.1934 1385.6982 1388.0145 1415.6530 1416.4467 1418.8612 1425.7334 1566.2664 1574.0254 1584.7972 1595.6797 3131.4974 3131.8917 3135.2412 3135.6654 3151.0175 3151.2639 3170.6644 3170.8927
redmass: 6.1654 4.2195 11.1040 4.6124 7.4593 6.3661 8.5743 6.7871 16.0042 10.8277 5.9319 14.5127 5.7146 8.9604 8.3460 3.9502 7.5551 4.8337 4.1557 4.1191 6.9333 6.8522 7.3109 7.2505 4.4683 4.5268 1.1903 1.2200 18.3785 18.4934 1.3042 1.3374 1.3752 7.6660 1.3782 7.0126 1.3388 1.3606 3.6288 2.8610 2.2175 2.5549 1.4827 1.4899 1.0693 1.0693 1.4600 1.4515 8.4231 9.3336 2.0708 2.2355 2.1078 2.2524 6.2569 6.2009 7.3032 7.6980 1.0876 1.0876 1.0901 1.0900 1.0927 1.0929 1.0999 1.0999
irintensity: 3.3459 0.0000 7.2113 0.0171 0.0000 1.7260 17.7575 1.5004 0.0037 0.0000 5.2183 11.7725 5.1310 0.0000 7.7994 15.5555 1.0026 64.7471 0.0000 9.9656 0.2050 0.3454 0.0000 1.1561 0.0000 12.6362 67.8830 96.4173 86.5495 3.4584 0.0000 0.5111 10.1223 0.0000 1.2893 3.2416 0.0000 0.0873 1.1370 2.0422 12.8168 9.0926 0.0000 2.9078 2.2408 0.1586 0.0000 3.5365 14.5002 2.6380 0.0000 18.8983 23.5794 7.8743 0.0000 0.5561 0.0039 0.0919 0.0000 14.3979 0.5351 0.1638 0.0000 0.9132 44.2725 9.6451
temp: 298.150 k
press: 1.00000 atm
elementType: 16 16 8 8 6 6 6 6 6 6 6 6 6 6 6 6 1 1 1 1 1 1 1 1
symmnumber: 1
zpe: 430348.2 jmol-1
zpe.correction: 0.163911 hartree
zpe.thermalcorrener: 0.177579 hartree
zpe.thermalcorrenthalpy: 0.178523 hartree
zpe.thermalcorrgfe: 0.123789 hartree
zpe.sumelectzpe: -1407.366508 hartree
zpe.sumelectthermal: -1407.352840 hartree
zpe.sumelectthermalent: -1407.351896 hartree
zpe.sumelectthermalfe: -1407.406630 hartree
dipole: 0.0000 -0.0001 1.4793
dipole: 1.4793
quadrupole: -84.6867 -126.8861 -104.3314
quadrupole: -0.0003 0.0000 -0.0008
quadrupole: 20.6147 -21.5847 0.9700 -0.0003 0.0000 -0.0008
hfenergy: -1407.5304188 hartree
pointgroup: C01 [X(C12H8O2S2)]
dipole: -0.0000052 -0.0000475 0.582012 debye
dipolederiv: 0.4610335 -0.0000515 0.0000472 -0.0000462 0.8761207 -0.388176 0.0000179 -0.11084 0.4446836 0.4610388 -0.0000562 -0.0000506 -0.0000558 0.8760953 0.3882178 -0.0000209 0.1108688 0.4447255 -0.420447 0.0000361 -0.0000371 0.0000297 -0.6919688 0.3081729 0.0000178 -0.1628414 -0.3463175 -0.4204422 0.0000353 0.0000385 0.0000359 -0.691971 -0.3082113 -0.0000198 0.1628209 -0.3463261 -0.0073604 -0.2363162 0.0813942 0.0352621 -0.1407959 0.0321272 0.0042578 0.0020297 -0.1303189 -0.0074021 0.2363517 -0.0814026 -0.0352232 -0.1407312 0.0321077 -0.0042642 0.0020242 -0.1303163 -0.0073975 0.2363376 0.0814237 -0.0352273 -0.1407281 -0.0321055 0.0042659 -0.0020238 -0.1303177 -0.0073549 -0.2363021 -0.081412 0.0352635 -0.1407905 -0.0321274 -0.0042571 -0.0020297 -0.1303217 -0.1766263 0.0093463 -0.0162571 0.096486 -0.0721033 0.0330787 -0.0354014 0.047989 -0.1034203 -0.1766052 -0.0093788 0.016246 -0.0965202 -0.0721282 0.03308 0.0353926 0.0479971 -0.1034223 -0.176607 -0.0093781 -0.0162475 -0.0965208 -0.072121 -0.0330769 -0.0354042 -0.0479966 -0.1034333 -0.176632 0.0093489 0.0162575 0.0964868 -0.0720957 -0.0330742 0.0354136 -0.0479854 -0.1034298 0.0245053 0.1054035 0.1196131 -0.0099187 0.0348609 0.014745 0.1095102 0.062936 -0.0463725 0.0245271 -0.1054036 -0.1196141 0.0099197 0.0348371 0.0147106 -0.1095325 0.0629054 -0.0463689 0.0245244 -0.1054141 0.1196021 0.0099105 0.0348463 -0.0147014 0.1095386 -0.0628979 -0.0463735 0.0245027 0.1054131 -0.119601 -0.0099119 0.0348692 -0.0147346 -0.1095146 -0.0629265 -0.0463796 0.15256 0.0252841 -0.0240534 -0.0287436 0.0429757 -0.0105096 -0.0252034 -0.0017556 0.1378446 0.1525553 -0.0252551 0.0240572 0.0287734 0.0429705 -0.0105009 0.0252041 -0.0017472 0.1378444 0.1525555 -0.0252528 -0.0240604 0.0287754 0.0429713 0.0104906 -0.0252011 0.0017386 0.1378464 0.152558 0.0252814 0.0240569 -0.0287462 0.0429711 0.0104986 0.0252017 0.0017459 0.1378456 -0.0133568 -0.0509315 -0.0988131 -0.060269 0.0429675 -0.0412737 -0.1161672 -0.0405359 0.0930784 -0.0133862 0.0509169 0.0988234 0.0602532 0.0429981 -0.0412455 0.1161806 -0.0405044 0.0930779 -0.0133858 0.050926 -0.0988187 0.0602654 0.0429897 0.0412406 -0.1161759 0.0404994 0.0930846 -0.0133572 -0.050941 0.0988079 -0.0602788 0.0429604 0.0412674 0.1161614 0.0405295 0.0930872 unknown
polarizability: 207.9821663|0.0014778|196.8828852|0.0001041|0.0047463|99.9361407 unknown
InChI: InChI=1S/C12H8O2S2/c13-15-9-5-1-2-6-10(9)16(14)12-8-4-3-7-11(12)15/h1-8H
charge 0 multiplicity 1
24 atoms
S  -0.000213 1.685542 -1.314267
S  0.000232 -1.685374 -1.314419
O  -0.000398 3.190327 -0.60621
O  0.000422 -3.190203 -0.606489
C  1.389946 0.698553 -0.419696
C  -1.39013 0.698183 -0.419704
C  1.390141 -0.698089 -0.419761
C  -1.389943 -0.69846 -0.41977
C  2.371038 1.429596 0.267224
C  -2.371427 1.428964 0.267197
C  2.371447 -1.428935 0.267057
C  -2.371043 -1.429562 0.267069
C  3.383612 0.708253 0.945298
C  -3.383805 0.707355 0.945277
C  3.383817 -0.70738 0.945215
C  -3.383614 -0.708281 0.945218
H  2.309821 2.524265 0.287902
H  -2.310512 2.52365 0.287859
H  2.310546 -2.523622 0.287611
H  -2.30984 -2.524232 0.287636
H  4.165107 1.253212 1.484886
H  -4.16545 1.252101 1.484865
H  4.16546 -1.252179 1.484753
H  -4.165113 -1.253287 1.484753
