program: Gaussian 09
title: 000237933
version: EM64L-G09RevD.01
frameworkgroup: C1[X(C7H11N3OS)]
method: RPBEPBE
basis: SDD
operation: Freq
keyword: #p
keyword: freq=noraman
keyword: PBEPBE/SDD
title: #p freq=noraman PBEPBE/SDD
converged: YES YES NO NO
title: Mulliken charges:
elementType: S O N N N C C C C C C C H H H H H H H H H H H
charge: 0.196353 -0.271716 -0.408562 -0.081134 -0.618459 -0.321651 -0.638970 -0.666329 -0.165101 -0.284793 0.178797 0.187642 0.284279 0.202965 0.253184 0.222123 0.214533 0.237011 0.221875 0.261291 0.325095 0.347517 0.324053
chargesum: 0.00000
title: Mulliken charges with hydrogens summed into heavy atoms:
elementType: S O N N N C C C C C C C
charge: 0.196353 -0.271716 -0.083467 -0.081134 0.053111 -0.037372 0.039302 0.007089 -0.165101 -0.023502 0.178797 0.187642
polarizability: 1.82765583e+02 6.76489412e+00 1.30466065e+02 -2.68459236e+00 -2.61066085e+00 6.55419810e+01
1716.lowfreq: -7.3132 -3.3642 0.0008 0.0009 0.0012 8.7172 32.7064 52.4150 100.4326
frequency: 32.2648 52.3482 100.4321 138.9223 164.8845 198.6076 218.0026 228.5125 245.6652 275.1161 311.0355 326.5834 339.0715 386.5755 437.4566 506.0861 513.1712 530.7283 566.2292 588.2983 594.8326 636.3748 700.0720 736.9910 813.0997 857.0120 884.2661 922.4029 925.6121 950.4980 957.1226 1033.8422 1063.8331 1135.3327 1147.1166 1164.8059 1196.0619 1247.0458 1302.5481 1310.3109 1351.0151 1378.7022 1397.1184 1458.1458 1461.4932 1466.1936 1475.7352 1485.6118 1512.0628 1568.6968 1624.6751 1657.3282 2973.7925 2980.4066 3054.1197 3066.7767 3078.3048 3091.5323 3102.0512 3196.0606 3508.0397 3557.6261 3708.0352
redmass: 5.5212 2.7194 3.9110 5.7213 5.6874 5.7814 1.0659 4.6394 1.2488 2.3480 1.1331 3.7995 3.2195 3.0424 5.2045 1.1657 4.6428 7.4037 6.4388 3.6563 3.6203 2.4617 1.9565 4.4285 1.6784 5.4170 2.6341 1.2946 4.5069 1.4419 3.0597 1.7519 1.3681 2.2966 2.4849 1.9596 2.8778 1.2921 1.5996 1.3909 3.0790 1.2212 1.2091 1.2164 3.3723 1.0472 1.0471 1.0474 8.0105 2.5192 1.6032 5.7756 1.0379 1.0360 1.0894 1.0974 1.0950 1.0996 1.0998 1.0933 1.0777 1.0454 1.1053
irintensity: 0.0213 0.3777 0.0870 0.0350 0.1007 14.2553 0.0523 4.6608 0.2375 0.1993 78.2470 2.1540 1.3036 2.5434 9.5433 232.2274 5.7056 0.3564 1.1246 5.0216 7.9967 63.2751 30.8628 25.1054 52.6281 57.2306 2.1678 3.6443 30.1407 3.8811 60.9162 9.9367 29.2776 6.0479 41.3447 26.5451 17.1853 22.9242 31.9550 4.7516 137.2964 21.1251 23.5192 10.1612 18.9287 1.6501 7.3632 13.2707 113.3686 338.3841 567.7709 752.1632 30.7520 43.0782 4.5312 3.4638 47.0554 25.2831 24.9901 0.2691 27.5544 94.6480 43.0677
temp: 298.150 k
press: 1.00000 atm
elementType: 16 8 7 7 7 6 6 6 6 6 6 6 1 1 1 1 1 1 1 1 1 1 1
symmnumber: 1
zpe: 471883.1 jmol-1
zpe.correction: 0.179731 hartree
zpe.thermalcorrener: 0.192726 hartree
zpe.thermalcorrenthalpy: 0.193670 hartree
zpe.thermalcorrgfe: 0.139930 hartree
zpe.sumelectzpe: -909.997537 hartree
zpe.sumelectthermal: -909.984543 hartree
zpe.sumelectthermalent: -909.983599 hartree
zpe.sumelectthermalfe: -910.037339 hartree
dipole: 1.5656 6.8258 -0.5536
dipole: 7.0249
quadrupole: -80.0991 -70.4493 -81.6556
quadrupole: -17.7855 1.5887 -1.0819
quadrupole: -2.6977 6.9520 -4.2543 -17.7855 1.5887 -1.0819
hfenergy: -910.1772682 hartree
pointgroup: C01 [X(C7H11N3O1S1)]
dipole: -0.4629736 -2.53835 0.9904466 debye
dipolederiv: -0.9360643 -0.0519031 0.1205551 0.0479922 -0.081996 0.0273192 0.0056603 -0.0125595 -0.1645029 -1.3923971 -0.4870126 0.2539811 -0.3881628 -0.6658315 0.130612 0.2005622 0.1333454 -0.4463346 -0.6256939 -0.1467935 0.0855397 -0.159716 -0.8722619 0.2136833 0.077447 0.2166576 -0.3698859 -1.0862085 0.7794775 -0.1982364 0.4166004 -1.1857285 0.2979669 -0.0985664 0.2921623 -0.3309351 -0.3208278 0.256398 -0.1115383 0.3649418 -1.4150868 0.207416 -0.1509781 0.2282613 -0.791933 0.4612078 0.2002511 -0.1289077 0.4587606 0.1878881 -0.1208895 -0.1826336 -0.0691328 0.2787791 -0.1058824 -0.019336 -0.0147279 -0.1186486 0.0388162 0.0569279 -0.0327346 -0.0004209 -0.1260734 -0.0971887 -0.0003633 -0.0501275 -0.156554 0.0527067 0.0215264 0.0496207 0.0321275 -0.0173286 1.7713992 -0.0955375 -0.1286232 -0.2607495 0.9128937 -0.2926051 -0.0073805 -0.3063646 0.1049332 -1.4353001 -0.394164 0.2416961 0.0070709 -0.2421359 0.0101042 0.0866527 0.0355334 -0.2352209 1.22842 -0.6320348 0.1443546 -0.3737037 1.6475233 -0.4406056 0.0700584 -0.4482163 0.4404973 1.8779291 0.5879975 -0.3389833 0.1671743 1.0231366 -0.2987899 -0.1603987 -0.3347902 0.3362472 0.0422673 0.0262367 0.0332905 -0.0173194 -0.0715425 -0.0251487 0.0551301 -0.0114029 -0.0102381 0.0013784 -0.1142375 0.0756687 -0.1520808 -0.060886 0.0921852 0.1213153 0.0761582 -0.0023174 -0.0696778 0.0155557 -0.1154645 0.0187261 0.0853946 0.0068994 -0.1136659 0.0006434 0.0690061 0.0566557 0.0781315 0.0568443 0.1145597 -0.0638143 -0.09885 -0.0000016 -0.0246541 0.0497133 -0.081776 -0.095792 0.0364199 -0.1390642 -0.0380131 0.0679794 0.0596723 0.080776 0.0735699 0.1098656 0.0028925 0.000988 0.0290549 0.1009069 -0.005512 -0.04653 -0.0221991 -0.1496877 0.0532162 0.0451523 0.0067712 0.1443673 -0.074195 -0.0585511 0.0262621 -0.0779587 0.0705503 0.0858667 0.0314789 -0.0063831 0.0436625 0.0252642 0.0515728 -0.0114103 0.0567287 0.1672136 0.1462016 0.0382224 -0.0004853 -0.016362 0.1587287 0.064952 0.0148964 0.0620167 0.310758 0.1548675 0.0267209 0.0043181 -0.0039983 0.2833435 0.0386506 0.0118633 0.0373282 0.3680504 0.1617415 -0.0513407 0.0330499 -0.0265515 0.2548892 0.0531564 0.0251588 0.0559604 0.3751394 unknown
polarizability: 181.1613731|5.7684123|121.2376328|-11.8351516|-23.8976565|76.3746234 unknown
InChI: InChI=1S/C7H11N3OS/c1-4(2)12-6-3-5(11)9-7(8)10-6/h3-4,9H,8H2,1-2H3
charge 0 multiplicity 1
23 atoms
S  -1.756791 1.251105 -0.421836
O  3.420015 1.728554 -0.883095
N  2.502505 -0.278506 -0.108232
N  0.159034 -0.632754 0.172168
N  1.658153 -2.34963 0.693077
C  -2.761405 -0.214147 0.309579
C  -2.708383 -0.184915 1.844636
C  -4.185856 -0.093342 -0.257357
C  -0.03923 0.661039 -0.280556
C  0.991949 1.526716 -0.652624
C  1.425359 -1.066571 0.247177
C  2.367317 1.088012 -0.586891
H  -2.250078 -1.112958 -0.072651
H  -3.285551 -1.036333 2.257016
H  -1.668563 -0.267417 2.202116
H  -3.145394 0.749937 2.23917
H  -4.805808 -0.924878 0.12777
H  -4.190241 -0.139589 -1.360198
H  -4.665251 0.853353 0.053233
H  0.801648 2.542938 -1.000983
H  3.469176 -0.614031 -0.051656
H  0.84518 -2.907157 0.94394
H  2.589217 -2.747526 0.7764
