program: Gaussian 09
title: 000226443
version: EM64L-G09RevD.01
frameworkgroup: C1[X(C18H26NO6P)]
method: RPBEPBE
basis: SDD
operation: Freq
keyword: #p
keyword: freq=noraman
keyword: PBEPBE/SDD
title: #p freq=noraman PBEPBE/SDD
converged: YES YES NO NO
title: Mulliken charges:
elementType: P O O O O O O N C C C C C C C C C C C C C C C C C C H H H H H H H H H H H H H H H H H H H H H H H H H H
charge: 1.380934 -0.242243 -0.204282 -0.513538 -0.480975 -0.484613 -0.582149 -0.157061 -0.294497 -0.284814 -0.218708 -0.219373 -0.520659 -0.225034 -0.225226 0.194453 0.149923 -0.363943 0.317828 -0.266561 -0.432084 -0.395987 -0.434232 -0.372954 -0.723090 -0.737317 0.290014 0.291012 0.262686 0.266570 0.266742 0.227957 0.254686 0.255456 0.251849 0.247640 0.259665 0.239798 0.236375 0.275621 0.251751 0.238929 0.206671 0.236125 0.200479 0.236995 0.228607 0.217472 0.221636 0.216233 0.231028 0.224204
chargesum: 0.00000
title: Mulliken charges with hydrogens summed into heavy atoms:
elementType: P O O O O O O N C C C C C C C C C C C C C C C C C C
charge: 1.380934 -0.242243 -0.204282 -0.513538 -0.480975 -0.484613 -0.582149 -0.157061 -0.004483 0.006198 0.043978 0.047197 -0.025960 0.029652 0.030230 0.194453 0.149923 0.135546 0.317828 0.232901 0.079912 0.094693 0.008564 0.064520 -0.055375 -0.065852
polarizability: 2.59365077e+02 1.12953622e+01 2.43441099e+02 6.87437684e+00 -4.20480523e+00 1.80277653e+02
1716.lowfreq: -9.5202 -3.4456 -0.0013 0.0007 0.0009 4.0519 21.7277 29.2270 31.2276
frequency: 19.9639 28.7363 31.0162 43.7391 56.1013 67.2783 75.5564 82.0641 93.5080 101.6418 114.7674 152.1933 158.0961 172.5274 191.8378 219.8574 221.9321 226.0397 243.6058 247.1331 282.6241 295.5765 300.6151 312.2999 332.6770 336.3787 351.2603 375.9369 390.4353 403.0743 405.5532 419.7488 447.5229 452.9482 489.2232 524.2606 550.1212 561.1132 568.4768 596.1885 600.2447 618.6316 668.0116 693.1207 696.7163 720.0593 722.8870 728.6955 762.4738 765.4760 783.1868 788.7223 833.8824 852.5022 856.1935 875.5579 886.8844 892.9526 906.9601 919.7131 926.4347 928.5621 940.1122 949.3423 951.8637 959.2762 972.6388 982.8609 984.9209 1002.2391 1021.7251 1027.5562 1051.0308 1055.3038 1061.4253 1073.5407 1082.6445 1087.5700 1094.8789 1106.0817 1116.9888 1121.1901 1148.5734 1159.8538 1167.6294 1172.7104 1186.5398 1187.1023 1220.4793 1225.6153 1244.9679 1251.7323 1253.4269 1260.0642 1264.2198 1275.2177 1283.2053 1290.9428 1313.2461 1317.5972 1327.6040 1332.9453 1344.9242 1348.8463 1352.7626 1364.7288 1365.6097 1381.7658 1393.5597 1396.5590 1430.6949 1453.6854 1464.8891 1466.7847 1469.6314 1470.7054 1479.9116 1483.4319 1489.8345 1491.2345 1496.0709 1581.2720 1617.9289 1684.2132 2975.9288 2982.8826 2983.6128 2990.3747 3007.3366 3007.7805 3010.1689 3011.0254 3024.4640 3024.7906 3041.6336 3043.2514 3057.1795 3073.9656 3074.9055 3078.3777 3082.1659 3085.5434 3093.5324 3094.6583 3100.7347 3103.2898 3105.6332 3112.7733 3165.4047 3197.2718
redmass: 4.9305 5.4777 4.4460 5.7810 6.4203 5.1579 2.8128 4.7690 3.8869 2.2933 3.9392 6.5721 3.9795 2.0759 3.8843 3.7524 1.7034 2.0119 6.6375 2.9783 2.3218 2.0575 3.3717 2.2969 5.7389 8.4695 4.0942 3.7287 2.5828 4.6129 4.8608 3.7811 2.1612 3.9835 3.2754 3.4982 4.1032 4.5401 4.0991 4.0709 4.4554 6.1234 6.9892 5.4208 7.0546 2.8629 1.9849 5.4010 1.2764 4.7083 3.5648 1.2856 2.4815 2.9592 2.9643 3.6327 6.2700 2.8642 2.2028 2.4873 1.7262 1.7128 2.0282 2.9403 2.3436 2.5909 1.7845 2.0559 1.8846 1.5437 1.7684 3.1712 1.9761 2.8115 1.7416 2.2267 1.2078 7.2515 3.3476 2.5085 1.0911 1.5384 1.9281 2.2047 2.1440 1.7713 1.4664 1.7969 1.4330 1.3491 1.2749 1.6262 1.3836 1.3459 1.3431 1.6066 1.1931 1.6065 1.3245 1.6796 1.7934 1.2068 3.0121 1.4801 1.4425 1.4658 1.3473 1.2839 1.2151 1.2027 1.1061 1.0783 1.0785 1.0682 1.0630 1.1026 1.0594 1.0485 1.0562 1.0532 1.0736 5.7722 12.0429 11.4726 1.0585 1.0372 1.0371 1.0618 1.0614 1.0608 1.0613 1.0618 1.0994 1.0614 1.0975 1.0850 1.0860 1.0991 1.0983 1.1006 1.1001 1.1050 1.1050 1.1042 1.1046 1.1033 1.0891 1.0934 1.0879 1.1096
irintensity: 1.1642 0.0565 1.0058 1.0448 0.1103 3.7449 0.1712 0.7668 1.0632 0.9779 1.5938 11.1871 4.9751 1.2033 3.4517 2.2379 0.4880 0.5949 1.2318 1.8411 0.9299 0.8104 8.9893 1.2472 15.3198 33.8090 15.7780 8.9909 8.4050 5.3311 10.7627 8.5382 2.8740 10.9115 3.6080 4.5381 0.0555 6.3290 7.9949 27.1638 11.6590 4.4604 177.4530 17.5352 85.2831 10.0200 51.8403 41.7503 21.0766 3.4868 6.3335 11.6444 26.5383 13.7031 11.0088 36.5619 17.2673 28.1655 7.1952 121.4311 31.1483 3.5882 29.9671 1.3028 35.2361 89.1180 23.7307 37.3063 31.6243 3.0767 2.4459 26.6522 22.9453 3.7854 40.2709 3.6569 12.2131 110.6839 38.8419 33.8995 0.6411 31.6215 0.1567 1.9657 82.6897 11.2589 0.0931 2.3869 14.6191 2.3292 7.8536 1.2804 3.1696 0.4146 0.6356 2.4757 1.3313 1.2814 2.3544 75.9860 8.9823 1.0224 126.2248 1.6105 1.0189 40.5483 34.9521 3.8437 23.7075 16.0524 27.7958 6.8582 5.3138 8.7705 5.0715 9.1147 16.9305 7.9978 9.3656 11.7051 7.2368 1.2701 592.5926 42.2706 15.5670 32.8130 19.7238 27.8593 24.5998 18.2745 12.7442 41.2792 11.9599 20.6440 5.2175 3.8376 8.2110 28.0777 53.9866 45.5756 44.8429 4.3293 14.1407 26.9349 14.9906 6.8489 33.2475 14.5100 2.2648 8.0554
temp: 298.150 k
press: 1.00000 atm
elementType: 15 8 8 8 8 8 8 7 6 6 6 6 6 6 6 6 6 6 6 6 6 6 6 6 6 6 1 1 1 1 1 1 1 1 1 1 1 1 1 1 1 1 1 1 1 1 1 1 1 1 1 1
symmnumber: 1
zpe: 1109273.8 jmol-1
zpe.correction: 0.422500 hartree
zpe.thermalcorrener: 0.448229 hartree
zpe.thermalcorrenthalpy: 0.449173 hartree
zpe.thermalcorrgfe: 0.365650 hartree
zpe.sumelectzpe: -1546.818575 hartree
zpe.sumelectthermal: -1546.792846 hartree
zpe.sumelectthermalent: -1546.791902 hartree
zpe.sumelectthermalfe: -1546.875425 hartree
dipole: -4.5440 6.8669 0.8542
dipole: 8.2784
quadrupole: -162.1513 -176.9672 -157.9055
quadrupole: 10.8751 7.6690 -7.9926
quadrupole: 3.5234 -11.2925 7.7692 10.8751 7.6690 -7.9926
hfenergy: -1547.241075 hartree
pointgroup: C01 [X(C18H26N1O6P1)]
dipole: -1.9749117 2.3809317 1.0191613 debye
polarizability: 257.1816087|8.8861566|241.2280439|13.1148495|15.4768021|184.6741771 unknown
InChI: InChI=1S/C18H26NO6P/c1-3-18(4-2)10-24-26(22,25-11-18)23-8-7-19-16(20)14-12-5-6-13(9-12)15(14)17(19)21/h5-6,12-15H,3-4,7-11H2,1-2H3
charge 0 multiplicity 1
52 atoms
P  2.699452 -1.589364 -1.121241
O  -0.568192 0.900497 0.380092
O  -3.313001 -2.588261 -1.129252
O  0.969341 -1.505306 -1.298752
O  3.001976 -1.275263 0.557802
O  3.126189 -0.126777 -1.913956
O  3.392607 -2.907351 -1.63756
N  -1.739799 -1.044905 -0.28605
C  -2.684284 1.037029 -0.942773
C  -3.614544 -0.118086 -1.429924
C  -3.642047 1.913344 -0.023583
C  -5.002583 0.213875 -0.725736
C  -4.964802 1.773088 -0.845729
C  -3.988296 1.062901 1.205311
C  -4.799443 0.047565 0.785383
C  -1.531782 0.350962 -0.212673
C  -2.933679 -1.403076 -0.970196
C  -0.831585 -2.052352 0.281398
C  3.273026 1.240614 0.229975
C  0.136468 -2.612426 -0.771366
C  2.635615 0.093489 1.060152
C  2.733411 1.150417 -1.22382
C  2.733077 2.566871 0.862906
C  4.828589 1.15632 0.219444
C  3.278041 3.876983 0.251087
C  5.512427 1.240556 1.600242
H  -2.280975 1.65488 -1.763129
H  -3.750753 -0.147533 -2.524257
H  -3.259355 2.924401 0.170897
H  -5.85559 -0.318057 -1.168261
H  -5.823192 2.255969 -0.350838
H  -4.878566 2.133194 -1.887668
H  -3.569854 1.213716 2.2033
H  -5.173997 -0.79418 1.372852
H  -1.4480 -2.883883 0.66955
H  -0.273611 -1.582616 1.108294
H  -0.41252 -3.033688 -1.629529
H  0.761574 -3.40698 -0.320965
H  3.009102 0.084009 2.09651
H  1.533832 0.193064 1.057589
H  1.629684 1.229286 -1.236477
H  3.177082 1.918622 -1.876474
H  2.970331 2.556159 1.945405
H  1.626611 2.561541 0.791477
H  5.213476 1.967143 -0.430317
H  5.126706 0.210799 -0.270781
H  4.373558 3.960966 0.364194
H  3.040856 3.966829 -0.824585
H  2.824721 4.747157 0.759938
H  5.266873 2.177341 2.133926
H  5.231963 0.391371 2.249124
H  6.61046 1.206045 1.480441
