program: Gaussian 09
title: 000226440
version: EM64L-G09RevD.01
frameworkgroup: C1[X(C7H13NO2)]
method: RPBEPBE
basis: SDD
operation: Freq
keyword: #p
keyword: freq=noraman
keyword: PBEPBE/SDD
title: #p freq=noraman PBEPBE/SDD
converged: YES YES NO NO
title: Mulliken charges:
elementType: O O N C C C C C C C H H H H H H H H H H H H H
charge: -0.252172 -0.285038 -0.560597 -0.153061 -0.016586 -0.416312 -0.022183 -0.422328 -0.395559 -0.453539 0.237777 0.211043 0.224430 0.200130 0.229093 0.227078 0.214359 0.215155 0.212496 0.240819 0.220077 0.273472 0.271445
chargesum: 0.00000
title: Mulliken charges with hydrogens summed into heavy atoms:
elementType: O O N C C C C C C C
charge: -0.252172 -0.285038 -0.015680 0.084717 0.194457 0.008249 0.206910 0.019108 0.032092 0.007357
polarizability: 9.52916736e+01 -9.33694413e-01 7.76179843e+01 -4.57663757e+00 1.75165704e+00 7.31786708e+01
1716.lowfreq: -22.3576 -0.7834 -0.0002 0.0006 0.0008 23.4500 79.8414 122.2087 189.7557
frequency: 79.6098 122.0810 189.7135 239.1598 243.9151 293.4761 337.4924 381.8951 416.6138 449.3289 467.9516 540.4206 585.5515 702.8015 723.4970 768.3177 795.7655 808.6207 847.9910 853.2095 880.9408 904.6943 949.1792 985.3387 994.6362 1051.2922 1057.1593 1092.8999 1098.6076 1122.6961 1135.7913 1155.5101 1191.9324 1234.2683 1244.9158 1255.5694 1291.0567 1302.9797 1311.9603 1318.9001 1333.8232 1344.3529 1353.4299 1357.0053 1361.5617 1448.2381 1457.1971 1470.6791 1478.3358 1639.5320 2967.8501 2984.9824 2998.1575 3008.6918 3017.1947 3038.2423 3054.9348 3070.9190 3074.2564 3078.3395 3081.6398 3484.4753 3614.0440
redmass: 2.8781 3.5210 2.0198 2.1333 1.4344 1.8168 2.9828 3.6619 3.7453 2.3321 1.6387 3.8368 3.1011 2.4850 4.8401 3.2243 3.7896 3.4369 2.5986 2.0313 2.3662 1.7721 2.4320 3.2700 2.0783 2.5933 1.7625 4.0559 2.2367 1.6310 1.2981 1.3259 1.8197 1.2420 1.2304 1.2133 1.2678 1.5487 1.3204 1.4037 1.3092 1.3291 1.3478 1.3871 1.4589 1.0852 1.0823 1.0789 1.0878 1.0925 1.0852 1.0608 1.0593 1.0625 1.0612 1.1006 1.1016 1.1032 1.0887 1.1001 1.0947 1.0443 1.0992
irintensity: 0.3692 1.4794 6.2212 3.5068 45.1608 6.9678 5.3918 16.2490 14.8193 48.7594 234.2438 83.4131 7.3259 2.4648 1.3744 10.2819 31.8386 10.3383 21.7617 3.1440 45.6853 13.4326 44.8815 15.0702 32.6012 32.7313 23.7680 10.6107 22.0146 3.2382 0.5051 11.9661 1.0859 2.8980 2.4881 1.9942 8.9414 9.2691 0.9580 3.0969 2.7215 2.0149 1.2250 0.3707 2.0556 8.1760 11.5787 0.3493 18.3125 38.7423 56.5153 31.3458 33.3772 33.9946 31.5561 18.7455 20.9483 73.7491 50.4213 19.9402 36.8739 1.0429 1.6609
temp: 298.150 k
press: 1.00000 atm
elementType: 8 8 7 6 6 6 6 6 6 6 1 1 1 1 1 1 1 1 1 1 1 1 1
symmnumber: 1
zpe: 521246.6 jmol-1
zpe.correction: 0.198532 hartree
zpe.thermalcorrener: 0.207879 hartree
zpe.thermalcorrenthalpy: 0.208823 hartree
zpe.thermalcorrgfe: 0.164594 hartree
zpe.sumelectzpe: -478.903865 hartree
zpe.sumelectthermal: -478.894519 hartree
zpe.sumelectthermalent: -478.893575 hartree
zpe.sumelectthermalfe: -478.937804 hartree
dipole: -0.1951 1.6072 0.8495
dipole: 1.8283
quadrupole: -59.4930 -60.7969 -63.6966
quadrupole: 3.1407 -8.0534 1.1730
quadrupole: 1.8359 0.5319 -2.3678 3.1407 -8.0534 1.1730
hfenergy: -479.1023976 hartree
pointgroup: C01 [X(C7H13N1O2)]
dipole: 0.0671749 -0.6547724 0.2901162 debye
dipolederiv: -0.681392 0.0709233 -0.0582181 0.0086961 -0.571298 0.0546528 -0.0447913 0.0436934 -0.5883225 -1.0868443 -0.0558609 -0.009771 0.0281758 -0.4811852 0.0526397 -0.0741076 0.0281424 -0.4547731 -0.9130818 0.2493623 0.136685 0.316612 -0.2937139 -0.0916228 0.2290846 -0.0984135 -0.5105365 0.3784193 -0.056526 0.0663124 -0.0030421 0.4022052 0.0109649 -0.0362653 0.0721102 0.2043537 0.5263518 0.0288547 0.0919514 -0.0784401 0.2012951 0.0725367 0.3340646 0.0405804 0.2381082 0.038328 -0.0297087 -0.0673842 -0.0248994 -0.0441823 -0.0528499 -0.0388071 -0.0504485 0.0243202 0.923434 0.0975489 0.092782 0.1984745 0.6241535 0.0035422 0.0369324 -0.0535072 0.5901259 0.0836894 0.0268615 -0.0477229 0.052598 0.0729388 -0.0196296 -0.0311939 0.0077554 0.0736792 -0.007568 -0.0392046 -0.0531344 -0.0657906 -0.1225624 -0.096568 -0.055476 -0.077324 0.0283004 0.5158792 -0.0957001 0.015183 -0.1358515 0.2154719 -0.0078398 0.0731975 -0.0352798 0.2851586 0.014783 0.0123354 -0.0868881 -0.0006494 0.0348138 0.0036164 -0.1093156 0.0196461 -0.0947257 -0.0792809 -0.0730797 -0.0678568 -0.0897162 -0.0946142 -0.0845519 -0.1011246 -0.083435 -0.058644 -0.0094822 -0.1047968 0.0856809 -0.0612991 0.0156976 0.0566532 0.0542056 0.0772684 -0.0568697 -0.1025411 0.149118 -0.0126091 0.1386137 -0.0238759 -0.0131862 0.0102771 -0.0440968 0.0546985 -0.0759194 0.0804886 -0.009281 0.1018315 -0.1057383 -0.0136632 0.0167838 -0.0277654 0.0546253 -0.0279561 0.0333912 0.1153402 0.0017592 0.0672961 0.0564004 0.1000615 0.0310917 -0.0577904 -0.0033842 -0.1095391 -0.0592644 -0.1018512 -0.1267221 -0.0783957 -0.0423323 -0.054938 0.0494148 0.0462825 0.0348408 -0.0676709 0.0413502 0.0432829 0.0550263 -0.1191172 0.0619106 -0.1170336 -0.1102645 -0.022683 0.0770364 -0.0697333 0.0421421 0.0083278 0.1262443 0.0111706 0.0273313 -0.0025442 -0.0245877 0.0441659 -0.0235445 -0.0279871 0.127047 0.051042 0.0952429 -0.0114278 0.0146533 -0.0351118 -0.080182 -0.0503739 -0.0590669 -0.1081472 -0.0643806 -0.0840199 0.0158509 0.2533586 -0.1273694 -0.0142425 -0.0954299 0.1522821 0.102524 -0.0975331 0.1702083 0.1299552 0.3050797 -0.0095568 -0.0909119 -0.0874899 0.0793673 -0.0374772 -0.2174488 -0.0495924 0.174201 unknown
polarizability: 95.1376659|-1.3761131|77.8629054|4.8030008|-1.481722|73.0877573 unknown
InChI: InChI=1S/C7H13NO2/c8-4-6-5-2-1-3-7(9-5)10-6/h5-7H,1-4,8H2
charge 0 multiplicity 1
23 atoms
O  -1.115478 0.606686 1.360833
O  -0.174534 1.339523 -0.670906
N  3.187304 -0.357435 -0.002809
C  0.099637 -0.234446 1.104988
C  0.898773 0.715789 0.17154
C  -0.36592 -1.570835 0.485925
C  -1.468141 1.011515 -0.009556
C  -1.175095 -1.361415 -0.826576
C  -2.153558 -0.161498 -0.728392
C  1.994945 0.105222 -0.731419
H  0.584225 -0.375524 2.083842
H  1.35028 1.518732 0.791289
H  -0.998891 -2.071305 1.243079
H  0.500109 -2.23648 0.298759
H  -2.077564 1.926491 0.055972
H  -0.480885 -1.171477 -1.664565
H  -1.730403 -2.284798 -1.073646
H  -2.47715 0.153041 -1.737692
H  -3.05857 -0.427188 -0.149081
H  2.301575 0.876862 -1.460355
H  1.586843 -0.735241 -1.318536
H  3.060573 -1.183615 0.585858
H  3.745227 0.373397 0.444249
