program: Gaussian 09
title: 000237925
version: EM64L-G09RevD.01
frameworkgroup: C1[X(C8H10N2O3S)]
method: RPBEPBE
basis: SDD
operation: Freq
keyword: #p
keyword: freq=noraman
keyword: PBEPBE/SDD
title: #p freq=noraman PBEPBE/SDD
converged: NO YES NO NO
title: Mulliken charges:
elementType: S O O O N N C C C C C C C C H H H H H H H H H H
charge: 0.284026 -0.243504 -0.228976 -0.242609 0.065977 0.011034 0.059593 -0.377915 0.219198 -0.441989 0.196150 -0.506723 -0.824134 -0.501740 0.294969 0.238368 0.238540 0.238432 0.273010 0.246221 0.273155 0.241643 0.243689 0.243587
chargesum: 0.00000
title: Mulliken charges with hydrogens summed into heavy atoms:
elementType: S O O O N N C C C C C C C C
charge: 0.284026 -0.243504 -0.228976 -0.242609 0.065977 0.011034 0.059593 -0.082946 0.219198 -0.441989 0.196150 0.208617 -0.031748 0.227179
polarizability: 1.84779043e+02 3.57444721e+00 1.58454962e+02 -5.66305603e-03 -2.92486037e-02 6.39386949e+01
1716.lowfreq: -8.7758 -0.0022 -0.0005 -0.0001 2.1335 3.6850 30.5919 59.3055 74.8870
frequency: 30.5654 59.2847 74.8864 98.6031 102.4976 105.0043 127.1905 133.9122 148.6169 172.4186 211.2230 220.0954 231.9452 263.2053 293.0922 338.4402 407.4478 439.9403 521.8166 522.3696 611.5528 643.2119 661.5441 710.3220 734.5512 772.2986 818.7619 864.4037 905.2568 921.2345 933.2896 976.5455 984.4933 1002.8706 1087.7293 1111.7112 1111.9357 1145.5307 1151.4217 1206.0219 1249.3691 1265.8655 1329.8478 1346.6879 1351.4476 1422.2613 1435.9760 1440.5555 1449.1673 1453.0082 1453.0966 1459.2632 1463.4691 1506.1349 1541.8302 1610.0004 3004.0538 3006.5633 3023.6594 3106.6185 3108.6392 3147.3309 3148.6609 3153.9897 3157.5056 3210.9563
redmass: 5.7405 3.3438 2.7639 1.1974 4.2376 1.1760 2.8384 3.4839 1.4167 3.2345 5.8286 3.5533 5.1254 4.7363 5.7375 6.5217 7.3923 8.7740 9.3854 7.9058 5.6890 6.7905 7.2029 7.1134 11.9669 4.3372 8.2223 8.2807 1.5696 9.4736 8.3446 1.1805 1.6178 2.7222 2.1508 1.2554 1.2654 1.4606 1.4900 3.7417 7.6953 11.8947 2.7142 1.3590 3.7730 1.2198 1.0530 1.4090 1.0711 1.0508 1.0497 1.0528 1.0590 9.3315 6.2960 10.0469 1.0294 1.0297 1.0281 1.1046 1.1045 1.1040 1.1046 1.1057 1.1047 1.0941
irintensity: 3.3182 3.7133 1.3076 0.0296 3.0821 0.1651 0.0378 0.7614 0.0414 0.6566 13.5708 2.6574 6.5486 6.5528 6.4828 21.4917 9.5911 0.6382 1.9072 3.7093 1.0437 0.0963 0.0196 31.4831 11.1427 3.2904 2.6976 52.2754 27.4120 4.4104 15.6715 8.7143 61.8401 85.3447 102.3770 0.1679 0.0637 30.5252 58.8987 105.3968 239.7301 4.5915 6.4651 47.8395 388.3597 30.2937 12.6349 45.6855 31.5756 12.8310 20.6039 8.6468 28.2429 323.3788 220.0651 131.0025 38.2250 30.3304 21.8146 26.5147 25.4162 18.3938 13.6491 13.5458 12.8957 6.7416
temp: 298.150 k
press: 1.00000 atm
elementType: 16 8 8 8 7 7 6 6 6 6 6 6 6 6 1 1 1 1 1 1 1 1 1 1
symmnumber: 1
zpe: 458787.0 jmol-1
zpe.correction: 0.174743 hartree
zpe.thermalcorrener: 0.190062 hartree
zpe.thermalcorrenthalpy: 0.191006 hartree
zpe.thermalcorrgfe: 0.130714 hartree
zpe.sumelectzpe: -1043.014200 hartree
zpe.sumelectthermal: -1042.998881 hartree
zpe.sumelectthermalent: -1042.997936 hartree
zpe.sumelectthermalfe: -1043.058228 hartree
dipole: -2.6898 0.5444 0.0002
dipole: 2.7444
quadrupole: -63.0597 -94.0524 -88.6914
quadrupole: -8.8118 0.0361 0.0324
quadrupole: 18.8748 -12.1179 -6.7569 -8.8118 0.0361 0.0324
hfenergy: -1043.1889423 hartree
pointgroup: C01 [X(C8H10N2O3S1)]
dipole: 1.0737496 -0.111042 -0.0228849 debye
dipolederiv: -0.1116955 -0.2790197 0.0176522 -0.4643427 -0.5190234 0.0405187 0.0299058 0.0353288 -0.0677693 -1.1752859 0.6410835 -0.0155316 0.7019189 -0.9450726 0.0190119 -0.0185407 0.0198984 -0.3174175 -1.2135981 0.3411102 0.007568 0.64525 -0.7637966 0.0105014 -0.0077198 0.0173783 -0.2641711 -0.8085046 -0.2450778 0.0268761 0.0560184 -0.8131049 0.0253528 0.0106206 0.0363969 -0.314679 -0.9398932 -0.7733282 0.0678862 -0.1229082 -0.8710011 0.0464002 0.0284906 0.0637975 -0.1570752 -0.4268455 0.1458487 -0.0014855 -0.0021884 -1.3666491 0.074079 0.0078838 0.0696646 -0.1441025 0.1783737 0.0855255 -0.0076232 -0.0742649 0.7519188 -0.0386861 0.0003574 -0.0428379 0.0721965 -0.7399357 0.4424825 -0.0094636 -0.0275426 -0.4053178 0.0184903 0.017336 0.0055025 -0.1173405 1.2204736 -0.7038447 0.0149056 -0.6961913 1.3094708 -0.0471674 0.0146235 -0.0467426 0.2105813 0.7076244 0.6729542 -0.0594404 0.6796931 1.5806665 -0.1150474 -0.0604225 -0.1141423 0.000837 1.6432178 -0.0736476 -0.0350557 -0.5594196 1.2839147 -0.043799 -0.0074738 -0.0588935 0.2137948 0.7411595 -0.283145 0.0045772 -0.0500502 0.2657925 0.0013614 -0.0094154 0.00747 0.2666932 0.1633901 0.0351277 -0.0044719 0.0597835 0.0137244 -0.0005619 -0.0061207 0.0005398 0.0480792 0.7108693 -0.1406036 -0.0042839 -0.1066065 0.2442987 0.0047956 -0.0067963 0.0064164 0.2785701 0.1526729 -0.036657 0.0028496 -0.0343698 0.0692103 0.0074352 0.0027139 0.0075408 0.180356 0.0281604 0.0697211 -0.0015327 0.1277411 -0.0993639 0.0097258 -0.0049009 0.0112647 0.1253636 -0.0327693 0.0387858 -0.0195229 -0.0966059 0.0633271 -0.1067894 -0.0474806 -0.0827232 -0.0443084 -0.0291007 0.0444166 0.0132095 -0.085384 0.0837802 0.0964549 0.0566926 0.0655261 -0.0683929 -0.0222008 0.0036595 -0.0410994 0.0872256 0.0818732 0.089303 -0.0385278 0.0634791 -0.0339072 0.0226329 -0.0888345 0.0088661 -0.1058874 -0.0735044 0.0171315 0.0100263 0.016464 0.1277668 -0.0165061 0.0051619 0.0387684 0.0856844 0.0594368 -0.1073083 0.0259209 -0.0766259 -0.0153295 0.0336575 0.043446 0.0002025 0.1108248 -0.0721033 0.0069844 -0.0032558 0.0089115 0.1231014 -0.0403611 0.0303482 0.0171664 -0.0580667 0.0694536 0.0951961 0.0657782 0.0586862 -0.0622359 -0.0455358 0.0244868 -0.021017 -0.0703115 0.0520695 -0.1033827 -0.0596952 -0.0723005 -0.0406108 unknown
polarizability: 183.7386673|5.8637195|159.0479784|-3.6497535|-5.8246186|64.3860538 unknown
InChI: InChI=1S/C8H10N2O3S/c1-12-6-4-5(7(11)13-2)9-8(10-6)14-3/h4H,1-3H3
charge 0 multiplicity 1
24 atoms
S  1.546019 2.871305 -0.29161
O  2.082184 -2.211718 -0.002242
O  -3.148942 0.807293 -0.036625
O  -2.990098 -1.511297 0.090478
N  -0.443144 1.085061 -0.129641
N  1.800704 0.134047 -0.132715
C  -0.953283 -0.184175 -0.041538
C  -0.140832 -1.334704 0.004514
C  1.260225 -1.108295 -0.045421
C  0.912345 1.174406 -0.170812
C  -2.447244 -0.380596 0.008437
C  3.541711 -1.970829 -0.054201
C  3.399932 2.554218 -0.328326
C  -4.626212 0.673146 0.01313
H  -0.569026 -2.33476 0.073919
H  3.982609 -2.976382 -0.007508
H  3.861509 -1.355111 0.803045
H  3.814814 -1.458907 -0.992064
H  3.713299 2.054998 0.598982
H  3.862641 3.549889 -0.411229
H  3.655408 1.932029 -1.197176
H  -4.996224 1.70615 -0.030049
H  -4.931958 0.174972 0.948309
H  -4.983541 0.08166 -0.846358
