program: Gaussian 09
title: 000237928
version: EM64L-G09RevD.01
frameworkgroup: C1[X(C12H12N4O2S)]
method: RPBEPBE
basis: SDD
operation: Freq
keyword: #p
keyword: freq=noraman
keyword: PBEPBE/SDD
title: #p freq=noraman PBEPBE/SDD
converged: NO YES NO NO
title: Mulliken charges:
elementType: S O O N N N N C C C C C C C C C C C C H H H H H H H H H H H H
charge: 0.219414 -0.208674 -0.208675 -0.047363 -0.096249 0.026700 -0.587581 0.482224 -0.802847 -0.344487 -0.344489 0.371093 -0.349355 -0.349355 -0.185482 -0.279809 0.253615 -0.773155 -0.069748 0.292670 0.292671 0.251648 0.251648 0.286945 0.286945 0.247267 0.253922 0.233569 0.233499 0.327976 0.335461
chargesum: 0.00000
title: Mulliken charges with hydrogens summed into heavy atoms:
elementType: S O O N N N N C C C C C C C C C C C C
charge: 0.219414 -0.208674 -0.208675 -0.047363 -0.096249 0.026700 0.075856 0.482224 -0.217505 -0.092838 -0.092840 0.371093 -0.062410 -0.062410 -0.185482 -0.032542 0.253615 -0.052166 -0.069748
polarizability: 3.42097595e+02 8.77575657e+00 1.50689658e+02 4.83238144e-03 -1.18606188e-03 1.33298584e+02
1716.lowfreq: -64.2261 -10.4930 -3.2812 -0.0010 0.0011 0.0018 0.7210 6.2916 20.7744
frequency: -64.2143 -9.6272 20.7348 31.8989 49.8703 68.3171 87.1459 134.5500 144.4953 185.1424 206.6180 213.3016 221.1239 291.2869 303.5833 334.2695 368.2015 407.0067 408.0008 473.7028 475.3491 490.2704 505.9988 532.3446 532.4523 565.8233 589.7685 620.8376 626.9429 638.9263 647.9224 676.0525 749.0694 764.9743 781.6987 822.0550 833.1872 840.8860 849.6379 871.7386 892.4169 910.8742 979.8984 986.5232 990.2885 993.5822 1006.1269 1046.5555 1064.3903 1091.6495 1091.8608 1129.0862 1149.8160 1180.7869 1218.1695 1220.5777 1242.8745 1279.8337 1294.7165 1300.5566 1363.8945 1383.9473 1392.0864 1402.8871 1417.9125 1440.9114 1446.6441 1467.2852 1474.9227 1480.6367 1525.1552 1537.1862 1596.8566 1605.8103 1608.7546 2990.6124 3052.6952 3071.1967 3122.8328 3127.6664 3145.7498 3148.2403 3174.5509 3184.9965 3187.3414 3561.7333 3721.0738
redmass: 1.0290 6.2901 4.9697 7.7658 5.8424 7.4032 7.6172 8.0176 4.8721 5.5280 4.8867 4.9729 5.1285 2.8937 6.3905 2.7714 8.5831 7.7339 2.8752 1.1985 3.3814 3.8757 7.0468 5.6968 1.1839 3.1382 6.2509 6.5227 6.8151 4.5924 6.7037 3.9601 5.0565 6.3262 7.0609 5.3666 5.7028 1.3672 1.2456 1.7631 1.5115 7.6827 1.9709 1.3399 2.1940 1.3744 3.0621 1.5888 2.6961 1.2270 3.3247 1.1021 1.5901 1.3415 2.1289 4.5323 1.6445 6.2671 3.9373 1.2800 7.9578 1.9977 1.6802 8.6742 3.5114 1.6238 1.1346 1.0460 1.7882 2.4988 5.1495 4.9597 7.7630 2.3357 2.6652 1.0379 1.0578 1.0973 1.0988 1.1084 1.0908 1.0910 1.0936 1.0945 1.0956 1.0441 1.1058
irintensity: 0.6461 0.6777 0.0027 0.7732 2.3821 0.0154 0.9006 2.5762 0.3980 11.1045 0.0031 3.5993 0.0431 6.7517 3.2224 0.8940 2.9226 15.3475 0.0072 284.3623 0.8160 7.7493 0.7621 5.1589 6.9777 3.8051 11.9654 0.2157 0.3736 11.2647 2.6160 40.9661 14.8284 28.0179 7.2836 3.3525 72.2482 25.4206 0.1135 51.6553 0.4845 1.1385 4.2095 2.9053 30.6213 0.0107 4.9012 8.6316 2.3957 12.9354 19.3789 5.8556 33.0306 76.3674 52.8355 353.2173 6.6647 3.9011 104.5600 0.0016 97.7174 4.6284 33.9135 0.3457 48.9059 26.5621 25.3267 17.3732 61.1773 8.6539 606.3436 266.6797 1.5377 345.4881 192.0298 14.6125 7.3939 15.4296 12.0887 1.8990 8.7586 5.8765 0.8735 0.0025 4.2788 112.7207 47.5699
temp: 298.150 k
press: 1.00000 atm
elementType: 16 8 8 7 7 7 7 6 6 6 6 6 6 6 6 6 6 6 6 1 1 1 1 1 1 1 1 1 1 1 1
symmnumber: 1
zpe: 598547.6 jmol-1
zpe.correction: 0.227975 hartree
zpe.thermalcorrener: 0.244284 hartree
zpe.thermalcorrenthalpy: 0.245229 hartree
zpe.thermalcorrgfe: 0.181897 hartree
zpe.sumelectzpe: -1230.566929 hartree
zpe.sumelectthermal: -1230.550619 hartree
zpe.sumelectthermalent: -1230.549675 hartree
zpe.sumelectthermalfe: -1230.613006 hartree
dipole: 6.1593 2.0825 0.0005
dipole: 6.5018
quadrupole: -156.2737 -104.8352 -115.1886
quadrupole: -2.3617 0.0046 0.0003
quadrupole: -30.8412 20.5973 10.2439 -2.3617 0.0046 0.0003
hfenergy: -1230.7949033 hartree
pointgroup: C01[X(C12H12N4O2S1)]
dipole: -2.4190959 0.8315027 0.0002851 debye
polarizability: 342.0045597|-9.7371979|150.7826841|0.0047984|0.0127681|133.2985941 unknown
InChI: InChI=1S/C12H12N4O2S/c1-8-6-11(15-12(13)14-8)19-7-9-2-4-10(5-3-9)16(17)18/h2-6H,7,13H2,1H3
charge 0 multiplicity 1
31 atoms
S  -0.919051 -1.030689 -0.000696
O  6.314803 -0.387989 -1.140981
O  6.3148 -0.389482 1.140558
N  -2.898086 0.88045 0.000469
N  -5.301841 0.39597 0.000044
N  5.715728 -0.291422 -0.000149
N  -4.49786 2.595128 0.001459
C  1.475745 0.402909 0.000311
C  -0.01102 0.653525 0.000473
C  2.186878 0.282798 -1.223846
C  2.186873 0.281136 1.224306
C  4.250833 -0.055283 0.000005
C  3.576051 0.055018 -1.235445
C  3.576047 0.053345 1.2356
C  -2.654357 -0.45359 -0.000402
C  -3.685671 -1.423477 -0.001069
C  -5.020598 -0.943563 -0.000837
C  -6.198799 -1.891888 -0.001699
C  -4.223927 1.248359 0.00068
H  -0.355783 1.192649 0.895292
H  -0.355772 1.193887 -0.893604
H  1.643697 0.367548 -2.171282
H  1.643688 0.364598 2.171855
H  4.140617 -0.037497 -2.166583
H  4.14061 -0.040425 2.166614
H  -3.469433 -2.49415 -0.001742
H  -7.137314 -1.317406 0.000425
H  -6.180377 -2.54506 -0.893373
H  -6.1786 -2.549053 0.886977
H  -3.732508 3.26316 0.001885
H  -5.468573 2.896298 0.001557
