program: Gaussian 09
title: 000237921
version: EM64L-G09RevD.01
frameworkgroup: C1[X(C8H10N2O3S)]
method: RPBEPBE
basis: SDD
operation: Freq
keyword: #p
keyword: freq=noraman
keyword: PBEPBE/SDD
title: #p freq=noraman PBEPBE/SDD
converged: YES YES NO NO
title: Mulliken charges:
elementType: S O O O N N C C C C C C C C H H H H H H H H H H
charge: 0.196397 -0.210587 -0.463918 -0.197899 -0.371487 0.060111 -0.349429 -0.575297 -0.244017 -0.669997 0.288524 -0.358144 0.033106 0.137080 0.216549 0.215580 0.287702 0.285435 0.217680 0.223882 0.217281 0.369175 0.287062 0.405210
chargesum: 0.00000
title: Mulliken charges with hydrogens summed into heavy atoms:
elementType: S O O O N N C C C C C C C C
charge: 0.196397 -0.210587 -0.058707 -0.197899 -0.002312 0.060111 0.082700 -0.002160 -0.244017 -0.011154 0.288524 -0.071082 0.033106 0.137080
polarizability: 1.88826774e+02 2.53435810e+00 1.53010840e+02 3.70885601e-02 6.71114960e-02 6.35052846e+01
1716.lowfreq: -8.6649 -2.9942 -0.0016 -0.0010 0.0018 2.5520 13.7711 35.0397 59.2937
frequency: 13.0107 34.9893 59.2786 65.4430 104.1973 125.8477 132.0290 140.6270 178.8405 220.8601 226.0386 247.4974 331.7761 371.2844 395.2875 440.7296 462.6271 538.0386 574.2659 596.2645 604.8916 624.0986 684.0150 688.9650 727.6500 737.8829 742.8663 825.8612 846.3359 856.6114 903.9874 915.7908 969.6489 1031.9883 1045.0660 1063.5282 1091.0490 1108.2573 1140.0742 1199.2768 1213.5592 1255.1365 1270.7859 1284.0240 1336.1343 1357.7366 1395.3695 1430.9943 1441.4716 1476.1753 1479.1227 1486.5403 1524.7872 1587.4989 1626.1868 1673.5960 2983.1556 2991.1825 3040.3474 3046.9076 3082.2564 3084.2620 3126.6264 3197.9255 3522.1784 3549.5558
redmass: 2.2236 2.8498 9.9434 4.9135 2.8910 8.1575 5.0175 6.8096 8.2505 4.3732 1.1079 6.4530 5.1215 6.0741 12.0930 11.7507 3.8810 8.9675 6.2239 1.7412 4.8920 3.1104 1.2062 5.5327 3.6908 8.3272 1.1069 9.3966 7.1843 1.1820 1.8856 1.5216 7.4519 3.0659 2.9594 1.1804 2.9715 2.1280 2.3694 2.5474 1.3988 1.2215 1.9991 1.1007 1.4386 2.0652 1.2006 5.4817 1.1114 1.0508 1.0407 1.0840 3.7223 11.7688 7.1509 9.7796 1.0354 1.0600 1.1022 1.0576 1.1014 1.0995 1.1088 1.0936 1.0787 1.0649
irintensity: 0.0337 1.8405 0.8405 2.3447 0.4640 3.1670 0.8300 0.9316 1.0378 3.1659 0.0187 2.6662 2.0399 2.1311 2.1015 24.6525 33.8288 3.8260 11.4922 82.9913 44.2043 41.2376 124.9835 13.8163 0.7210 16.6123 17.3607 21.7176 0.3512 0.4332 21.7475 29.9004 142.5393 87.6780 4.1125 2.0332 133.7253 11.1482 75.4122 205.0723 0.0009 4.4634 29.9662 0.0924 11.4291 100.1519 13.9420 144.7548 7.3403 3.8554 14.1781 8.8132 744.9211 113.0938 127.1385 174.3504 32.7378 19.8967 6.7711 4.8526 46.7926 41.5257 15.4491 2.7878 111.0086 72.7067
temp: 298.150 k
press: 1.00000 atm
elementType: 16 8 8 8 7 7 6 6 6 6 6 6 6 6 1 1 1 1 1 1 1 1 1 1
symmnumber: 1
zpe: 463734.1 jmol-1
zpe.correction: 0.176627 hartree
zpe.thermalcorrener: 0.191322 hartree
zpe.thermalcorrenthalpy: 0.192266 hartree
zpe.thermalcorrgfe: 0.131968 hartree
zpe.sumelectzpe: -1043.045701 hartree
zpe.sumelectthermal: -1043.031006 hartree
zpe.sumelectthermalent: -1043.030062 hartree
zpe.sumelectthermalfe: -1043.090360 hartree
dipole: -0.6383 -6.5152 0.0294
dipole: 6.5465
quadrupole: -77.2952 -100.5601 -89.2442
quadrupole: -11.0806 -0.0371 -0.0034
quadrupole: 11.7380 -11.5270 -0.2110 -11.0806 -0.0371 -0.0034
hfenergy: -1043.2223278 hartree
pointgroup: C01 [X(C8H10N2O3S1)]
dipole: -0.3002168 2.5001957 0.5408279 debye
dipolederiv: -0.8710949 0.1878064 -0.0152712 0.3686059 -0.2658652 -0.0088166 0.0317402 -0.0232423 -0.1102964 -0.5012181 -0.0857856 -0.0299336 0.1935946 -1.1882302 -0.175292 0.0337625 -0.1958851 -0.4029126 -0.3885272 0.0008898 0.0034256 -0.1073251 -1.2807828 -0.2005134 -0.020946 -0.1923762 -0.4854064 -1.1355552 0.0306142 -0.0531525 0.006966 -0.5423784 -0.0550231 -0.0575809 -0.0533506 -0.3161491 -1.290338 0.3194431 -0.0073801 -0.0456058 -0.6850991 -0.1169113 -0.0910678 -0.091552 -0.2158043 -0.7801658 0.4420051 0.0594613 0.842187 -1.3251863 -0.1935785 0.1547708 -0.2250982 -0.2529344 -0.01666 -0.0035701 -0.0146076 -0.2494914 0.0915789 -0.0374526 -0.0794485 -0.0188076 0.1484186 0.562072 0.1050221 0.0606868 0.2935894 0.0492502 0.0040292 0.1023183 -0.0085802 0.1404592 1.5538589 -0.2801052 0.0451154 -0.8226262 1.1626732 0.1952934 -0.0820347 0.2372583 0.0907285 -0.0993609 -0.0387281 -0.0249593 0.0929306 0.0491125 -0.0049241 0.0099882 -0.0150707 0.0919227 0.1031896 -0.6325875 -0.1423317 -0.6557377 0.2219962 -0.0118092 -0.148448 -0.0094851 0.054398 -0.3317522 -0.3085069 -0.0872825 0.1485934 -0.2813499 -0.0291904 0.0177909 -0.0618252 -0.1190505 1.0660134 -0.0648226 0.0457323 -0.421613 1.6207184 0.286998 -0.0360762 0.3135228 0.3017001 1.5858238 0.2534215 0.1532937 0.2734493 1.5959537 0.3258862 0.1568287 0.3238627 0.3447706 0.0572808 -0.016728 -0.0025973 0.0286517 0.0343617 -0.0838479 0.0361009 -0.0982113 -0.1183207 0.0598342 -0.0395767 0.0075148 0.0215989 -0.0803387 0.1097288 -0.0031014 0.1159396 -0.0050107 -0.0063244 -0.0129094 -0.0117071 -0.0540062 -0.0282296 0.0629134 -0.0593149 0.0516909 0.0154677 -0.0185476 -0.0081869 0.0051665 -0.0663185 0.0310012 -0.0673865 0.0296401 -0.0488402 -0.0415564 0.1015758 0.0099898 -0.024076 -0.0486006 -0.0675219 0.110894 0.0045282 0.1270707 -0.0151464 -0.2043324 0.0773762 -0.003804 0.0887773 0.0370623 -0.0120471 -0.0011823 -0.0129231 0.1049325 0.0960167 0.0081344 0.0560702 -0.0302461 0.0484921 -0.081871 0.0019236 -0.090903 -0.1272743 0.3124866 0.0531202 0.0110281 0.0728939 0.2883263 -0.0058336 0.0147494 -0.0072374 0.3364758 0.0155945 0.0180146 -0.0067102 0.019583 0.1248022 -0.008227 -0.0060593 -0.0083374 0.1641005 0.1301307 -0.0143302 -0.0236817 0.0501494 0.3896533 -0.0030185 -0.0088818 -0.0076197 0.416488 unknown
polarizability: 188.2560835|-3.8062055|148.4917409|8.4145236|19.3342888|68.595074 unknown
InChI: InChI=1S/C8H10N2O3S/c1-2-3-14-8-9-5(7(12)13)4-6(11)10-8/h4,9,12H,2-3H2,1H3
charge 0 multiplicity 1
24 atoms
S  -1.806098 1.5000 0.043667
O  0.538289 -2.960799 -0.813712
O  3.101919 2.299437 0.575314
O  4.458318 0.426255 0.242764
N  0.85935 1.011374 0.121537
N  -0.503895 -0.884724 -0.413364
C  -4.54838 0.983323 -0.280355
C  -3.19419 0.262587 -0.364949
C  -0.368419 0.388087 -0.110135
C  -5.701434 0.012247 -0.62641
C  2.028591 0.250629 0.030117
C  1.960029 -1.089183 -0.282679
C  0.65005 -1.736461 -0.525817
C  3.323976 0.941516 0.280381
H  -4.697238 1.390263 0.738207
H  -4.564886 1.842311 -0.978525
H  -3.102938 -0.563919 0.357061
H  -2.980882 -0.129147 -1.371913
H  -5.726687 -0.844713 0.071505
H  -6.676304 0.528051 -0.565659
H  -5.592362 -0.388524 -1.65084
H  0.933622 2.00568 0.354913
H  2.872774 -1.684778 -0.354376
H  3.965293 2.761788 0.741867
