program: Gaussian 09
title: 000226437
version: EM64L-G09RevD.01
frameworkgroup: C1[X(C7H12N2S7)]
method: RPBEPBE
basis: SDD
operation: Freq
keyword: #p
keyword: freq=noraman
keyword: PBEPBE/SDD
title: #p freq=noraman PBEPBE/SDD
converged: YES YES NO NO
title: Mulliken charges:
elementType: S S S S S S S N N C C C C C C C H H H H H H H H H H H H
charge: 0.068613 0.068758 0.300208 0.300582 0.050742 0.050797 0.217071 0.021088 0.021297 -0.613042 -0.633707 -0.613203 -0.634001 -0.456193 -0.456125 -0.748212 0.242382 0.227732 0.272620 0.261762 0.287974 0.235016 0.242621 0.227533 0.272535 0.235073 0.261888 0.288192
chargesum: 0.00000
title: Mulliken charges with hydrogens summed into heavy atoms:
elementType: S S S S S S S N N C C C C C C C
charge: 0.068613 0.068758 0.300208 0.300582 0.050742 0.050797 0.217071 0.021088 0.021297 0.129691 0.151046 0.129485 0.151151 -0.456193 -0.456125 -0.748212
polarizability: 3.49409754e+02 -6.49785933e-02 1.80199706e+02 -4.29481443e-02 -1.40285198e+01 1.82428554e+02
1716.lowfreq: -0.0030 -0.0029 -0.0011 4.1436 4.1644 8.6928 23.2508 39.9043 40.4799
frequency: 22.8064 39.7680 40.4356 41.8886 47.2987 69.2592 77.1128 85.3840 91.9804 92.9928 98.6193 107.3809 120.1760 121.1375 144.9122 145.8505 197.5992 200.3707 246.1037 256.8318 262.1583 292.2019 301.6526 312.8800 369.9382 375.0821 403.2257 408.4565 424.5848 434.2102 440.3300 448.5469 523.8295 527.0905 533.1025 535.7232 811.3263 827.5395 832.4117 932.4775 933.9503 948.3758 1050.2639 1050.6216 1085.4210 1085.7604 1127.2786 1129.1334 1138.6838 1140.0356 1233.5946 1234.5298 1374.5961 1378.7660 1423.6994 1424.2262 1453.1292 1455.2790 1468.3931 1470.7773 1475.0757 1479.6148 1482.9066 1484.2703 1499.1913 1500.3974 2962.1972 2962.5163 2971.8157 2972.9855 3047.0781 3047.7579 3057.7927 3058.6077 3101.9278 3102.4046 3112.7096 3112.8405
redmass: 5.0511 4.7303 10.1273 7.5319 10.6071 6.5012 1.6809 1.3207 5.3515 5.3582 1.8395 2.3791 14.1925 4.5940 1.4162 1.5591 6.9244 4.9697 2.7114 2.9670 8.2211 6.7970 8.5828 15.4950 6.4070 6.1356 3.9547 3.5020 28.3986 9.2213 11.8887 14.8748 8.8375 7.5567 4.7931 5.2783 13.3941 5.9217 5.8711 4.9076 5.4247 11.6821 1.5511 1.5423 1.2219 1.2217 1.4855 1.4655 1.7160 1.7236 3.9215 3.8895 2.1709 2.2265 1.1510 1.1665 1.1176 1.1261 1.0703 1.0731 1.0604 1.0458 1.0472 1.0699 1.4547 1.3811 1.0363 1.0360 1.0358 1.0360 1.1022 1.1024 1.1004 1.1004 1.0982 1.0982 1.0995 1.0994
irintensity: 0.3894 0.5464 1.3235 1.1150 0.0258 7.5429 0.1382 0.0703 0.0254 2.8036 1.1171 0.0143 2.7792 0.8876 0.9045 2.7850 1.6221 1.2429 15.0243 0.1994 6.4361 6.3521 0.6226 1.7456 8.8300 28.6039 2.3570 2.3457 1.2283 3.3181 13.2910 6.3289 0.4434 2.0169 0.6620 4.4910 107.2678 34.7468 20.7806 86.7328 65.3859 219.7501 1.0878 26.1808 0.9230 2.6834 9.3739 29.0651 76.1524 44.7063 32.6564 54.1947 88.5768 36.9140 20.1359 20.8145 11.2150 12.2613 57.6712 5.3166 16.9474 4.6516 1.9648 2.9168 187.9143 94.7795 39.2041 2.0143 2.5776 130.1522 16.3694 1.0097 61.2047 2.3447 8.0051 26.2839 0.4689 5.4386
temp: 298.150 k
press: 1.00000 atm
elementType: 16 16 16 16 16 16 16 7 7 6 6 6 6 6 6 6 1 1 1 1 1 1 1 1 1 1 1 1
symmnumber: 1
zpe: 492163.3 jmol-1
zpe.correction: 0.187455 hartree
zpe.thermalcorrener: 0.210252 hartree
zpe.thermalcorrenthalpy: 0.211197 hartree
zpe.thermalcorrgfe: 0.131646 hartree
zpe.sumelectzpe: -3168.594838 hartree
zpe.sumelectthermal: -3168.572041 hartree
zpe.sumelectthermalent: -3168.571097 hartree
zpe.sumelectthermalfe: -3168.650648 hartree
dipole: -8.4123 0.0011 -0.0039
dipole: 8.4123
quadrupole: -129.2334 -154.4616 -146.7518
quadrupole: -0.0018 0.0277 11.5755
quadrupole: 14.2489 -10.9793 -3.2695 -0.0018 0.0277 11.5755
hfenergy: -3168.7822933 hartree
pointgroup: C01 [X(C7H12N2S7)]
dipole: 0.0580557 -3.3091092 0.0113378 debye
polarizability: 168.0921696|-3.2711525|349.3494004|4.6613716|-0.3765775|194.5964436 unknown
InChI: InChI=1S/C7H12N2S7/c1-8(2)5(10)13-15-7(12)16-14-6(11)9(3)4/h1-4H3
charge 0 multiplicity 1
28 atoms
S  -1.866539 1.651619 0.258568
S  1.798383 1.716297 -0.2657
S  -1.375087 3.540491 -0.946356
S  1.242634 3.593264 0.928595
S  -1.118402 0.530411 -2.592745
S  1.096946 0.591577 2.595979
S  -0.112906 6.076436 -0.015402
N  -1.850032 -0.953207 -0.394828
N  1.879398 -0.882157 0.408584
C  -1.861455 -2.198865 -1.19007
C  -2.192292 -1.086848 1.043285
C  1.929503 -2.121916 1.211329
C  2.226342 -1.013585 -1.02866
C  -1.581934 0.259519 -0.979297
C  1.568165 0.324346 0.984142
C  -0.081109 4.381756 -0.010582
H  -2.81045 -2.738755 -1.019597
H  -1.017361 -2.852098 -0.89597
H  -1.765225 -1.945816 -2.256567
H  -3.202819 -0.687538 1.253448
H  -1.451192 -0.56033 1.674289
H  -2.175483 -2.154813 1.312367
H  2.899269 -2.627629 1.053168
H  1.112847 -2.807247 0.912828
H  1.814034 -1.866515 2.275333
H  2.258937 -2.083677 -1.287511
H  3.217361 -0.570346 -1.243562
H  1.461569 -0.527374 -1.66377
