program: Gaussian 09
title: 000237920
version: EM64L-G09RevD.01
frameworkgroup: C1[X(C12H8Cl2N2O3S)]
method: RPBEPBE
basis: SDD
operation: Freq
keyword: #p
keyword: freq=noraman
keyword: PBEPBE/SDD
title: #p freq=noraman PBEPBE/SDD
converged: NO YES NO NO
title: Mulliken charges:
elementType: Cl Cl S O O O N N C C C C C C C C C C C C H H H H H H H H
charge: -0.046955 -0.039040 0.230670 -0.213671 -0.463489 -0.194511 -0.368475 0.015053 0.648112 -0.851771 -0.281349 -0.340355 -0.232752 0.288959 -0.207192 -0.227612 -0.097597 -0.351082 0.046002 0.139953 0.326091 0.302132 0.299670 0.373529 0.282093 0.266646 0.289308 0.407634
chargesum: 0.00000
title: Mulliken charges with hydrogens summed into heavy atoms:
elementType: Cl Cl S O O O N N C C C C C C C C C C C C
charge: -0.046955 -0.039040 0.230670 -0.213671 -0.055855 -0.194511 0.005053 0.015053 0.648112 -0.223548 -0.281349 -0.040685 -0.232752 0.288959 0.074901 0.039033 -0.097597 -0.061774 0.046002 0.139953
polarizability: 2.43832002e+02 2.22552553e-01 2.16605190e+02 -2.59547229e+00 -1.89100097e+01 1.27851176e+02
1716.lowfreq: -1.6795 0.0020 0.0023 0.0027 2.5221 4.5555 15.2310 24.1014 35.3644
frequency: 15.1632 24.0893 35.3627 58.3938 71.3491 95.1328 117.0036 131.1059 138.9565 166.7759 173.8976 187.9363 190.1954 251.1040 288.7517 331.1936 352.1198 368.3822 381.7161 402.4525 425.1996 441.6550 449.2194 464.7877 534.4288 542.8361 577.7074 598.0417 605.1672 612.7217 625.3189 637.8557 687.6843 695.8129 726.7923 731.8092 738.5777 819.2990 827.1367 839.8340 848.6325 863.4991 881.8713 915.8420 971.3970 973.0903 1025.2914 1032.9881 1082.0666 1092.9239 1136.5511 1142.0788 1183.5833 1204.8198 1218.3841 1251.7091 1271.0888 1272.4159 1358.4415 1366.5246 1379.9357 1428.1514 1436.3146 1460.7848 1524.0872 1565.5101 1587.9958 1592.3351 1627.2581 1673.9125 3052.6611 3133.9343 3156.7742 3179.9003 3184.9827 3197.5229 3517.2559 3551.2131
redmass: 12.1959 11.0362 11.4961 10.6012 10.8997 11.2890 8.0871 9.2383 5.7438 5.8676 9.9510 9.6985 13.7283 7.7326 3.7466 7.4375 11.6084 9.8512 7.9679 5.1902 4.2549 6.5025 3.8717 3.9952 7.2450 7.6319 5.8935 1.8588 4.6259 4.5288 2.9056 7.3840 6.3162 1.2636 3.8552 3.9901 8.8809 3.7388 9.5817 1.7614 4.2120 1.4007 1.8638 1.5120 2.2029 2.3915 3.9189 3.0915 2.5674 2.8726 1.4478 2.3594 1.0856 2.6557 2.7078 1.1463 1.9396 1.3849 2.0918 3.7287 4.8095 1.3483 3.6037 2.4941 3.6712 7.7516 11.3514 7.4539 7.0853 9.8756 1.0581 1.1078 1.0905 1.0962 1.0938 1.0937 1.0787 1.0650
irintensity: 0.3563 4.0198 2.4795 0.3005 0.5232 1.5225 0.5721 1.6606 0.6633 0.2511 2.1864 2.7090 0.7347 3.4215 2.8768 5.1126 0.6395 9.5295 5.9325 13.2360 12.2345 11.6578 6.6835 35.0356 3.7762 6.8964 14.8617 74.7829 37.4180 63.7719 46.4765 4.0819 22.4802 128.6371 2.0393 12.6620 18.4139 50.2634 18.5243 49.8090 2.9278 20.1666 10.6749 29.0956 75.0701 64.3490 27.4584 100.6774 34.6548 141.1414 10.5448 58.0246 1.7548 209.2472 13.3386 14.0678 24.9230 9.8199 101.1352 4.7901 9.0561 71.1614 146.0258 73.0239 624.0675 42.5908 128.8178 53.0663 118.8745 181.8081 7.0854 2.1915 2.1110 1.5743 0.5172 3.4290 117.3340 78.0518
temp: 298.150 k
press: 1.00000 atm
elementType: 17 17 16 8 8 8 7 7 6 6 6 6 6 6 6 6 6 6 6 6 1 1 1 1 1 1 1 1
symmnumber: 1
zpe: 476751.9 jmol-1
zpe.correction: 0.181585 hartree
zpe.thermalcorrener: 0.200263 hartree
zpe.thermalcorrenthalpy: 0.201207 hartree
zpe.thermalcorrgfe: 0.131216 hartree
zpe.sumelectzpe: -2114.024084 hartree
zpe.sumelectthermal: -2114.005406 hartree
zpe.sumelectthermalent: -2114.004462 hartree
zpe.sumelectthermalfe: -2114.074453 hartree
dipole: -2.3829 4.3696 -2.6708
dipole: 5.6484
quadrupole: -130.9618 -144.2360 -136.1079
quadrupole: -15.3037 14.0137 2.6700
quadrupole: 6.1401 -7.1341 0.9940 -15.3037 14.0137 2.6700
hfenergy: -2114.2056694 hartree
pointgroup: C01 [X(C12H8Cl2N2O3S1)]
dipole: 0.9018241 -1.9908084 0.4023413 debye
polarizability: 243.5886903|-2.4141662|191.7369862|-5.3727593|-44.0512736|152.9626928 unknown
InChI: InChI=1S/C12H8Cl2N2O3S/c13-7-2-1-6(8(14)3-7)5-20-12-15-9(11(18)19)4-10(17)16-12/h1-4,15,18H,5H2
charge 0 multiplicity 1
28 atoms
Cl -3.533902 -2.158256 2.143235
Cl -5.625311 0.604574 -2.180652
S  0.08467 -1.325146 1.682053
O  1.672172 2.992829 -0.551688
O  4.279729 -2.421104 -0.795005
O  5.290813 -0.625723 -1.899855
N  2.28586 -0.99393 0.134485
N  1.002036 0.989982 0.48572
C  -2.309939 0.123914 1.047841
C  -1.239504 0.005689 2.097198
C  -3.407062 -0.769586 0.962289
C  -2.261994 1.181859 0.099046
C  1.207484 -0.295395 0.67346
C  3.220786 -0.300613 -0.64088
C  -4.421099 -0.646825 -0.005644
C  -3.259599 1.339819 -0.885737
C  -4.325241 0.419948 -0.921069
C  3.062197 1.046734 -0.879383
C  1.896127 1.770771 -0.32513
C  4.370436 -1.074619 -1.189974
H  -0.666054 0.939103 2.19722
H  -1.620227 -0.333909 3.072272
H  -1.414909 1.874202 0.135957
H  2.420142 -1.998173 0.286134
H  -5.253775 -1.352978 -0.042679
H  -3.206474 2.159842 -1.606552
H  3.789765 1.587785 -1.488399
H  5.041676 -2.943495 -1.160063
