program: Gaussian 09
title: 000237914
version: EM64L-G09RevD.01
frameworkgroup: C1[X(C11H11ClN2O2)]
method: RPBEPBE
basis: SDD
operation: Freq
keyword: #p
keyword: freq=noraman
keyword: PBEPBE/SDD
title: #p freq=noraman PBEPBE/SDD
converged: YES YES NO NO
title: Mulliken charges:
elementType: Cl O O N N C C C C C C C C C C C H H H H H H H H H H H
charge: -0.050567 -0.211596 -0.224201 -0.451347 -0.396936 0.085277 -0.382138 0.452888 0.167845 0.157900 -0.700482 -0.398726 -0.342676 -0.205074 -0.230690 -0.114334 0.231337 0.224607 0.329629 0.352743 0.241446 0.200619 0.234723 0.252277 0.262118 0.257853 0.257507
chargesum: 0.00000
title: Mulliken charges with hydrogens summed into heavy atoms:
elementType: Cl O O N N C C C C C C C C C C C
charge: -0.050567 -0.211596 -0.224201 -0.121719 -0.044193 0.085277 0.073806 0.452888 0.167845 0.157900 -0.023695 -0.146449 -0.080558 0.052779 0.026817 -0.114334
polarizability: 1.92986146e+02 7.77992800e+00 1.24212285e+02 4.02301990e+00 1.88134946e+01 1.12567205e+02
1716.lowfreq: -11.9862 -0.0018 -0.0012 -0.0010 3.1041 7.5119 34.1966 48.6377 64.0371
frequency: 33.6263 48.6324 64.0312 93.8955 133.3005 147.5256 163.2317 174.4258 223.8488 264.3375 283.2713 307.6436 328.7281 360.4602 399.3546 409.3703 450.0967 480.9292 501.9185 542.7489 602.9939 617.7665 625.1083 639.1266 666.8519 696.9439 718.2193 733.6474 741.6171 781.4595 827.2144 832.4007 900.0215 946.7957 960.3132 967.5744 977.2368 999.2393 1017.6623 1074.8137 1077.6983 1094.2635 1109.5330 1145.5201 1191.0315 1199.9207 1209.3722 1283.9845 1297.1882 1304.6338 1313.9456 1333.9995 1359.0352 1368.2041 1391.8790 1395.7578 1465.2942 1476.2049 1480.0145 1484.1113 1584.7439 1598.0269 1680.8198 1724.1485 2982.9248 3002.2390 3056.3689 3078.6379 3091.7915 3150.3918 3153.7953 3172.7889 3176.8271 3585.8355 3605.4224
redmass: 4.2715 6.8603 6.0347 3.1398 4.7442 5.0389 7.5983 2.2852 1.8236 9.2574 3.0869 4.2386 5.6562 4.1366 6.4336 2.9468 5.4942 1.3720 2.3610 3.8328 8.7716 4.2421 6.5244 1.6702 2.5219 5.5603 4.5908 6.1771 3.8552 1.3706 1.4726 1.3243 2.7284 1.5342 2.6573 1.4500 2.5161 4.1702 2.1743 3.1701 3.0661 1.9296 1.5398 2.4529 1.1264 3.6438 3.1015 1.4004 1.2611 2.9506 1.8672 1.7602 1.7174 6.2348 3.2815 1.2482 1.0755 2.2998 1.0551 1.0474 7.5763 6.1927 8.7015 9.4607 1.0372 1.0623 1.0985 1.0990 1.1005 1.0883 1.0888 1.0960 1.0971 1.0803 1.0796
irintensity: 0.1492 0.1653 0.5394 0.3094 0.1457 1.3807 2.8345 1.4174 0.7393 1.7355 0.9727 3.3892 4.9451 0.8298 12.7658 1.4497 7.2203 120.6325 28.3430 7.8983 11.3119 11.8998 3.7867 119.8835 21.2702 1.0954 19.4351 60.8635 10.3109 24.3137 39.5435 19.2614 21.9468 4.2242 7.0634 1.6968 23.3378 42.9706 6.2498 29.7129 18.7974 6.0241 7.2928 7.1015 1.1452 19.3745 76.2925 29.8102 0.8557 200.2354 16.1211 45.4992 8.3733 8.6040 13.2857 11.8315 13.0412 79.5183 11.0762 8.2634 4.3236 12.5440 485.0994 465.6939 24.8981 19.8508 3.0504 37.7283 38.4225 2.5449 2.0227 4.8932 0.4430 79.3622 35.1351
temp: 298.150 k
press: 1.00000 atm
elementType: 17 8 8 7 7 6 6 6 6 6 6 6 6 6 6 6 1 1 1 1 1 1 1 1 1 1 1
symmnumber: 1
zpe: 534519.8 jmol-1
zpe.correction: 0.203588 hartree
zpe.thermalcorrener: 0.218284 hartree
zpe.thermalcorrenthalpy: 0.219228 hartree
zpe.thermalcorrgfe: 0.160824 hartree
zpe.sumelectzpe: -1144.666694 hartree
zpe.sumelectthermal: -1144.651998 hartree
zpe.sumelectthermalent: -1144.651054 hartree
zpe.sumelectthermalfe: -1144.709458 hartree
dipole: -0.2068 2.0520 -1.9317
dipole: 2.8257
quadrupole: -115.1748 -101.5336 -100.3102
quadrupole: -6.9663 -1.4200 -3.8375
quadrupole: -9.5019 4.1393 5.3626 -6.9663 -1.4200 -3.8375
hfenergy: -1144.8702819 hartree
pointgroup: C01 [X(C11H11Cl1N2O2)]
dipole: -0.0461017 -0.8000015 0.7705841 debye
polarizability: 193.5495016|-4.7773116|124.147832|-4.7192746|18.4587696|112.0683026 unknown
InChI: InChI=1S/C11H11ClN2O2/c1-2-11(9(15)13-10(16)14-11)7-3-5-8(12)6-4-7/h3-6,13-14H,2H2,1H3
charge 0 multiplicity 1
27 atoms
Cl 5.054654 0.756019 -0.084324
O  -1.314251 -0.969424 -2.347677
O  -3.556384 2.009886 0.53756
N  -1.785828 0.454772 0.89282
N  -2.578783 0.672646 -1.191555
C  -0.994034 -0.514861 0.111804
C  -1.252186 -1.983021 0.585323
C  0.509162 -0.174726 0.066981
C  -1.616208 -0.328529 -1.315129
C  -2.730384 1.152316 0.150807
C  -0.757948 -2.264803 2.018115
C  1.041197 0.9301 0.773604
C  1.385022 -0.978943 -0.70837
C  2.424119 1.220809 0.734369
C  2.766694 -0.699193 -0.761629
C  3.267898 0.395307 -0.030124
H  -0.756669 -2.661819 -0.131834
H  -2.33891 -2.180148 0.51112
H  -1.753586 0.533951 1.907172
H  -3.154516 1.022359 -1.95803
H  0.323891 -2.067898 2.11853
H  -1.292663 -1.651508 2.768041
H  -0.936104 -3.322515 2.280418
H  0.378501 1.583733 1.349167
H  0.987473 -1.809004 -1.300721
H  2.83121 2.074117 1.28423
H  3.437732 -1.316922 -1.364967
