program: Gaussian 09
title: 000226417
version: EM64L-G09RevD.01
frameworkgroup: C1[X(C16H24)]
method: RPBEPBE
basis: SDD
operation: Freq
keyword: #p
keyword: freq=noraman
keyword: PBEPBE/SDD
title: #p freq=noraman PBEPBE/SDD
converged: YES YES NO NO
title: Mulliken charges:
elementType: C C C C C C C C C C C C C C C C H H H H H H H H H H H H H H H H H H H H H H H H
charge: -0.096499 0.105200 0.132022 0.311899 0.314451 -0.419476 -0.749529 -0.758091 -0.761632 -0.767401 -0.604327 -0.436100 -0.725576 0.459792 -0.421211 -0.825067 0.192936 0.222194 0.192349 0.222242 0.216360 0.222111 0.222907 0.208680 0.212874 0.222636 0.215518 0.219333 0.221981 0.227818 0.206277 0.239506 0.232968 0.212963 0.211594 0.214031 0.225860 0.223312 0.222496 0.232598
chargesum: 0.00000
title: Mulliken charges with hydrogens summed into heavy atoms:
elementType: C C C C C C C C C C C C C C C C
charge: 0.096437 0.105200 0.132022 0.311899 0.314451 -0.004933 -0.088815 -0.113630 -0.104145 -0.111326 -0.364821 -0.203133 -0.086988 0.459792 -0.195351 -0.146660
polarizability: 2.13309869e+02 -5.40411762e-01 1.72747493e+02 3.78599370e-02 -2.72231439e-01 1.20625546e+02
1716.lowfreq: -17.2821 -10.0483 -4.3854 -0.0001 0.0007 0.0007 7.5057 60.9743 82.2695
frequency: -16.1299 60.9679 82.1901 108.1820 122.3825 168.1899 187.0393 199.6774 212.6240 222.4906 235.8638 241.0977 250.8327 268.3514 282.6607 293.4886 300.3459 308.3004 313.8576 346.9639 374.1322 395.7063 416.6982 500.8669 516.0608 539.9880 562.3758 596.8085 602.9614 661.9722 711.5002 765.3850 770.4814 808.2063 827.4880 828.2104 895.0562 897.4278 925.6672 927.3192 935.6290 944.7584 954.9783 960.9510 994.4909 997.4598 1002.4988 1045.1970 1045.8958 1056.5322 1078.7273 1095.3806 1126.0967 1129.7796 1139.4372 1180.0605 1181.5139 1201.7576 1207.0958 1248.1211 1263.9438 1274.4940 1290.2228 1300.7302 1333.9171 1344.5292 1369.8601 1372.8423 1377.6411 1387.1465 1391.9968 1396.3829 1398.6978 1418.7857 1453.1915 1462.0672 1464.5541 1468.4210 1472.4906 1473.1885 1474.9162 1476.5803 1479.7542 1481.3287 1483.4868 1487.9684 1491.6972 1494.4842 1591.2833 1620.9858 2946.3779 2966.3343 2966.8891 2970.9341 2972.8863 2975.3592 2976.8475 2979.3782 3022.5368 3051.3143 3056.2566 3062.1630 3066.0449 3067.2995 3068.8723 3071.2038 3073.5286 3077.9303 3080.0351 3082.7511 3086.6319 3106.6988 3108.5247 3132.9900
redmass: 1.0131 3.3384 3.1191 2.2498 2.8688 2.5630 1.3266 1.7732 1.8061 1.3153 1.5060 1.1895 1.6780 1.3005 2.1134 1.7759 2.8860 2.5020 2.6693 3.1062 2.9735 2.7675 2.9936 3.3382 3.4989 3.4519 2.6613 3.3198 3.3150 2.9566 4.1183 1.7986 3.5302 2.5061 1.5801 1.6654 1.6748 2.0980 1.6306 1.5169 1.6683 1.9047 1.3747 2.0118 1.3928 1.3234 1.3263 1.8502 1.6186 2.6085 1.8103 1.9321 2.5226 1.7142 1.9613 2.4624 2.4373 2.1890 2.6725 2.6731 1.3591 1.6818 3.1943 1.3119 1.3371 1.5686 1.2350 4.5684 1.1985 1.2446 1.2242 1.2252 1.1972 3.4161 1.0591 1.0500 1.0505 1.0735 1.0672 1.0531 1.1092 1.0644 1.0606 1.0863 1.3936 1.2018 1.1266 1.2866 7.1137 6.8850 1.0826 1.0616 1.0351 1.0386 1.0354 1.0362 1.0359 1.0362 1.0968 1.0949 1.0989 1.0993 1.0994 1.0987 1.0986 1.0998 1.0999 1.0996 1.0996 1.0984 1.0981 1.0906 1.0867 1.0965
irintensity: 0.4799 0.2307 0.0555 0.3157 1.2135 0.2028 0.0939 0.0368 0.1419 0.0465 0.0913 0.1367 0.4754 0.2420 0.0551 0.0057 0.2387 0.4291 0.4240 0.4279 0.5412 1.1589 0.7452 4.7554 5.8969 0.2134 2.6701 3.1821 0.6961 2.0374 1.1549 3.2812 0.2180 1.0076 15.1330 22.9944 2.8771 2.2415 5.2643 2.1655 6.5856 8.8847 0.4943 5.0106 1.0962 1.6378 0.9118 4.0230 10.5880 8.0023 4.1777 3.6495 3.1326 3.7550 7.3257 3.8755 4.9890 2.1438 8.1116 6.6260 0.5501 2.5232 10.8635 3.2407 1.4520 3.2132 3.2011 2.9099 35.1836 10.3211 20.4132 9.0959 8.5883 5.3687 5.2406 0.1991 0.5124 7.2181 16.3198 12.1897 4.6081 12.0320 11.8363 13.5573 3.3963 5.9987 9.0459 41.2283 2.3973 6.0269 24.7189 27.6271 36.9598 49.5001 22.3524 21.2546 61.4982 29.5655 18.4650 24.0157 21.4289 2.7859 42.9934 47.1486 102.0185 32.5383 35.5594 31.7443 18.3716 65.7601 21.0234 22.6606 16.1666 28.7716
temp: 298.150 k
press: 1.00000 atm
elementType: 6 6 6 6 6 6 6 6 6 6 6 6 6 6 6 6 1 1 1 1 1 1 1 1 1 1 1 1 1 1 1 1 1 1 1 1 1 1 1 1
symmnumber: 1
zpe: 927246.8 jmol-1
zpe.correction: 0.353170 hartree
zpe.thermalcorrener: 0.369948 hartree
zpe.thermalcorrenthalpy: 0.370892 hartree
zpe.thermalcorrgfe: 0.311273 hartree
zpe.sumelectzpe: -622.883584 hartree
zpe.sumelectthermal: -622.866805 hartree
zpe.sumelectthermalent: -622.865861 hartree
zpe.sumelectthermalfe: -622.925480 hartree
dipole: 0.2063 0.3133 0.1119
dipole: 0.3915
quadrupole: -94.5607 -95.9844 -102.7677
quadrupole: -0.0750 -0.0817 -0.3015
quadrupole: 3.2102 1.7865 -4.9968 -0.0750 -0.0817 -0.3015
hfenergy: -623.2367536 hartree
pointgroup: C01 [X(C16H24)]
dipole: -0.0831023 -0.1226453 0.0421536 debye
polarizability: 213.2849283|-1.1303824|172.7559798|0.2727504|0.9403471|120.6420003 unknown
InChI: InChI=1S/C16H24/c1-7-14-15(3,4)12-9-8-11(2)10-13(12)16(14,5)6/h8-10,14H,7H2,1-6H3
charge 0 multiplicity 1
40 atoms
C  -1.687375 -0.295607 -0.362324
C  -0.570257 -1.374947 -0.030604
C  -1.099015 1.123635 0.042901
C  0.705668 -0.528175 -0.050708
C  0.411762 0.854142 0.006582
C  -3.090838 -0.669835 0.17024
C  -0.727141 -2.03221 1.374148
C  -0.560016 -2.494303 -1.10324
C  -1.517955 1.593065 1.466649
C  -1.488938 2.220931 -0.985202
C  2.042222 -0.976558 -0.078161
C  1.463094 1.793515 0.038649
C  -4.260742 0.152449 -0.416384
C  3.112341 -0.04392 -0.049095
C  2.803179 1.341825 0.007447
C  4.557939 -0.514767 -0.054719
H  -1.755091 -0.277483 -1.472585
H  -3.110186 -0.598643 1.274566
H  -3.269916 -1.738798 -0.068453
H  -1.650046 -2.637801 1.4344
H  0.129654 -2.703259 1.571256
H  -0.752304 -1.279515 2.181403
H  -0.354805 -2.080649 -2.107424
H  0.211582 -3.256282 -0.88361
H  -1.537081 -3.013354 -1.13707
H  -1.237918 0.859095 2.242408
H  -1.014067 2.546192 1.713716
H  -2.608776 1.762802 1.52797
H  -1.166609 1.938585 -2.004196
H  -2.580356 2.387002 -1.003326
H  -1.008654 3.185967 -0.734623
H  2.266703 -2.050172 -0.12905
H  1.252788 2.869461 0.07567
H  -4.223763 1.210195 -0.099594
H  -4.245489 0.13365 -1.522771
H  -5.232906 -0.257767 -0.084915
H  3.623235 2.070777 0.022786
H  4.670709 -1.471669 -0.594779
H  5.223896 0.226044 -0.53195
H  4.930971 -0.674217 0.976191
