program: Gaussian 09
title: 000226415
version: EM64L-G09RevD.01
frameworkgroup: C1[X(C16H22O)]
method: RPBEPBE
basis: SDD
operation: Freq
keyword: #pfreq=noraman
keyword: PBEPBE/SDD
title: #p freq=noraman PBEPBE/SDD
converged: NO YES NO NO
title: Mulliken charges:
elementType: O C C C C C C C C C C C C C C C C H H H H H H H H H H H H H H H H H H H H H H
charge: -0.240100 0.164104 -0.439316 0.343694 -0.449898 0.311125 -0.560563 -0.735292 -0.736136 -0.567962 -0.645711 0.406990 0.167676 -0.525840 0.081414 -0.695195 -0.800255 0.201100 0.203715 0.209003 0.211300 0.223603 0.228505 0.226689 0.219575 0.213448 0.214506 0.207914 0.225037 0.237934 0.239862 0.246794 0.200172 0.207971 0.215269 0.253148 0.238533 0.235592 0.261594
chargesum: 0.00000
title: Mulliken charges with hydrogens summed into heavy atoms:
elementType: O C C C C C C C C C C C C C C C C
charge: -0.240100 0.164104 -0.034501 0.343694 -0.029595 0.311125 -0.108455 -0.075580 -0.088679 -0.330028 -0.405849 0.406990 0.167676 -0.078874 0.081414 -0.018807 -0.064536
polarizability: 2.29556306e+02 -3.05667383e+00 1.87319231e+02 1.60404301e+00 2.04843563e+00 1.16217208e+02
1716.lowfreq: -0.0007 0.0003 0.0005 3.4644 8.3261 15.3032 35.2985 44.2481 70.4213
frequency: 35.2280 44.1627 70.4060 102.6104 116.3021 150.8751 151.8292 181.3486 207.2262 214.5883 238.6027 255.6407 260.1788 277.1721 291.6154 303.9573 325.7695 344.8130 361.7541 398.0488 439.4436 459.3626 475.9650 483.6694 491.4381 522.9145 572.5504 614.1046 638.4364 688.1596 702.9648 721.2842 762.1733 787.0402 816.3348 851.6045 880.8327 909.3350 912.0428 916.2452 926.4880 941.8433 954.2135 969.0416 997.7388 1019.6531 1023.4149 1038.7416 1060.1209 1066.3154 1074.1860 1093.2302 1120.9000 1162.7143 1187.9910 1199.8978 1208.5223 1221.3670 1239.8589 1252.9272 1262.4234 1285.1342 1304.1877 1311.2961 1327.8176 1339.3664 1347.4141 1365.3154 1376.0285 1377.1585 1377.8749 1391.6430 1399.7590 1448.5681 1451.1968 1459.2452 1462.3260 1464.4278 1466.1029 1472.1591 1473.1527 1478.1433 1480.1661 1486.8166 1488.1336 1497.5808 1544.8959 1585.1678 1613.8516 2955.4116 2965.8885 2971.2574 2975.0476 2981.8787 2984.3704 2988.5101 2989.3347 3022.4920 3029.3275 3047.8560 3063.5772 3065.4344 3070.1023 3071.7524 3075.1922 3078.7999 3081.6512 3100.9181 3102.7558 3121.9046 3150.9454
redmass: 3.8291 3.4265 2.9453 2.7973 3.2936 3.7056 3.0484 1.0466 1.0898 1.2821 2.4168 2.1524 1.1367 2.4376 2.6640 4.6083 2.5671 2.9676 2.1801 3.3922 2.6512 3.5068 2.9997 3.0463 2.9820 3.3051 2.8560 3.0908 3.4938 4.6260 3.5075 4.3647 2.9935 1.1962 2.3055 1.4997 2.3564 2.1543 1.5483 1.8020 1.4990 2.0996 1.9889 1.9666 1.3227 1.8898 2.0423 1.7045 1.9752 1.5597 2.1328 2.0874 1.4818 1.7219 1.9917 1.9926 2.0886 2.7406 1.8645 1.7073 1.7621 1.5496 1.5075 1.4500 1.7938 1.4470 1.5479 1.2406 2.9097 1.2350 1.6470 2.3627 1.3269 1.1326 1.0964 1.0783 1.0860 1.0528 1.0520 1.0691 1.0756 1.0833 1.1335 1.1028 1.0862 2.0826 6.0626 7.4519 6.5430 1.0651 1.0597 1.0351 1.0375 1.0375 1.0374 1.0629 1.0631 1.0956 1.0963 1.1032 1.0995 1.0971 1.0988 1.0970 1.1001 1.0992 1.0974 1.0949 1.0958 1.0994 1.0883
irintensity: 4.1202 0.3971 0.2873 1.2309 0.3835 1.3249 0.1136 0.5894 0.1046 0.3010 0.9148 0.4891 0.0394 0.2674 0.1957 3.8679 0.1159 0.7343 0.4264 2.5649 1.9084 0.7287 1.2146 2.3924 0.7517 2.1488 3.3576 17.7564 1.2265 1.1091 0.7962 0.6601 0.9815 5.3135 6.3159 2.6317 0.8164 13.1044 0.6480 16.5014 1.7225 14.6554 19.0444 2.9464 0.8031 1.2910 2.3984 0.2499 20.5286 2.5451 21.2833 7.3804 1.4528 13.4976 0.8252 5.6349 3.6753 2.9979 57.2580 4.2252 125.5067 24.0228 16.2873 1.9846 3.9042 4.9896 2.1729 46.0584 7.3066 16.3795 8.9027 4.1899 14.8045 32.3631 14.1116 1.6910 6.3962 1.5812 20.4339 9.8710 6.7198 19.3822 35.7441 10.3873 2.5227 20.7507 94.7265 124.6118 43.0313 20.9881 29.5562 29.3784 43.5185 44.8775 5.8461 30.2920 44.0765 31.7972 58.0771 52.0798 9.7109 16.8869 85.1904 12.4879 29.1782 37.4892 33.8717 0.3444 48.0066 17.7677 10.5635
temp: 298.150 k
press: 1.00000 atm
elementType: 8 6 6 6 6 6 6 6 6 6 6 6 6 6 6 6 6 1 1 1 1 1 1 1 1 1 1 1 1 1 1 1 1 1 1 1 1 1 1
symmnumber: 1
zpe: 885050.9 jmol-1
zpe.correction: 0.337098 hartree
zpe.thermalcorrener: 0.354537 hartree
zpe.thermalcorrenthalpy: 0.355481 hartree
zpe.thermalcorrgfe: 0.292715 hartree
zpe.sumelectzpe: -696.856185 hartree
zpe.sumelectthermal: -696.838747 hartree
zpe.sumelectthermalent: -696.837802 hartree
zpe.sumelectthermalfe: -696.900569 hartree
dipole: 4.1920 -0.0984 -0.0014
dipole: 4.1931
quadrupole: -114.1541 -94.6796 -105.0871
quadrupole: 1.3882 0.7299 0.4502
quadrupole: -9.5138 9.9607 -0.4469 1.3882 0.7299 0.4502
hfenergy: -697.1932832 hartree
pointgroup: C01 [X(C16H22O1)]
dipole: -1.6467795 -0.0966125 0.0172973 debye
polarizability: 229.6871601|0.7295332|186.6300012|-3.3763036|6.1606364|116.7755838 unknown
InChI: InChI=1S/C16H22O/c1-5-12-9-13-7-6-8-16(3,4)15(13)10-14(12)11(2)17/h9-10H,5-8H2,1-4H3
charge 0 multiplicity 1
39 atoms
O  3.907645 -0.649799 -0.37211
C  -2.316942 -0.948519 0.011383
C  -3.488657 -0.000619 0.414247
C  -0.980066 -0.172954 -0.063638
C  -3.442169 1.361632 -0.305549
C  -0.913662 1.251245 -0.038033
C  -2.161074 2.113263 0.104961
C  -2.615304 -1.579855 -1.383446
C  -2.241218 -2.087552 1.068301
C  0.234856 -0.878824 -0.20769
C  0.349573 1.880809 -0.148538
C  1.572912 1.183671 -0.267714
C  1.509278 -0.253211 -0.299838
C  2.853365 2.004375 -0.343702
C  2.728667 -1.116429 -0.444212
C  3.529741 2.177939 1.043585
C  2.551578 -2.620339 -0.686126
H  -3.449479 0.178475 1.508885
H  -4.445228 -0.520131 0.210303
H  -4.333317 1.963043 -0.044529
H  -3.461508 1.217744 -1.403362
H  -2.258082 2.431216 1.164975
H  -2.039883 3.042406 -0.483779
H  -2.743558 -0.804759 -2.160196
H  -1.789977 -2.240322 -1.706526
H  -3.540726 -2.18508 -1.339968
H  -3.230352 -2.573562 1.168373
H  -1.515293 -2.871591 0.786667
H  -1.949956 -1.691543 2.058259
H  0.192704 -1.971713 -0.242921
H  0.383418 2.978865 -0.143249
H  3.581433 1.530625 -1.021852
H  2.602646 3.004756 -0.747713
H  2.838277 2.643145 1.770311
H  4.423929 2.821837 0.955263
H  3.85352 1.199585 1.435726
H  1.902099 -2.824836 -1.556405
H  2.100454 -3.11585 0.194307
H  3.546156 -3.057543 -0.862351
