program: Gaussian 09
title: 000237877
version: EM64L-G09RevD.01
frameworkgroup: C1[X(C4H11O4P)]
method: RPBEPBE
basis: SDD
operation: Freq
keyword: #p
keyword: freq=noraman
keyword: PBEPBE/SDD
title: #p freq=noraman PBEPBE/SDD
converged: YES YES NO NO
title: Mulliken charges:
elementType: P O O O O C C C C H H H H H H H H H H H
charge: 1.380157 -0.579373 -0.662070 -0.669768 -0.589318 0.065471 -0.345451 -0.685765 -0.683545 0.211089 0.213189 0.194726 0.221088 0.254570 0.208900 0.239734 0.211504 0.215366 0.403613 0.395880
chargesum: 0.00000
title: Mulliken charges with hydrogens summed into heavy atoms:
elementType: P O O O O C C C C
charge: 1.380157 -0.579373 -0.258456 -0.273887 -0.589318 0.276561 0.062464 -0.001207 -0.016941
polarizability: 8.82295347e+01 -2.68763360e+00 8.00599315e+01 -1.50823859e+00 2.00750763e+00 7.17793757e+01
1716.lowfreq: -19.5631 -0.0001 0.0022 0.0023 5.8601 13.6127 18.2759 43.7712 86.0581
frequency: -14.8596 43.7552 86.0151 115.4397 179.9909 184.1234 211.5814 220.4057 249.4073 268.1151 293.7919 330.2861 351.8019 372.5648 387.8926 432.1568 473.9789 619.2993 691.1724 756.7092 785.7376 836.4747 883.0762 963.1330 977.4893 994.0578 1008.3071 1039.6407 1099.8474 1121.0889 1131.3576 1177.1337 1259.0845 1289.4229 1341.7823 1355.4384 1388.5599 1394.8801 1446.8667 1463.7341 1475.4949 1478.7285 1484.8629 2980.7654 2986.2990 2987.4598 2990.4780 3039.9718 3080.4290 3086.6067 3094.5777 3104.6270 3577.6239 3587.3901
redmass: 4.2229 4.9743 1.8623 3.9628 2.6650 1.7711 1.2259 1.3751 2.3767 1.4861 3.4651 3.7623 2.0736 5.0903 3.1375 3.8604 3.2175 4.5714 4.9968 10.2945 1.3937 2.3087 4.2148 1.2999 1.5468 1.3637 1.2489 3.2010 1.8763 2.7858 2.2175 2.0738 1.1915 1.3013 1.2363 1.5685 1.2248 1.2097 1.0763 1.0532 1.0456 1.0480 1.0497 1.0647 1.0622 1.0508 1.0410 1.1000 1.0996 1.0986 1.0999 1.1009 1.0657 1.0661
irintensity: 1.1503 2.2544 0.6051 14.3110 0.2494 81.2376 0.5071 0.3719 14.9666 30.9463 60.2840 9.9302 45.2355 59.2533 63.2404 8.2145 10.3346 18.0105 154.5591 251.8491 9.9836 69.8450 266.3518 31.4946 57.4653 32.4696 23.1780 10.3912 69.3313 104.7617 24.2667 8.0793 0.8822 1.2478 13.4882 5.4183 21.7329 17.1380 4.6600 11.0566 10.6573 11.6534 15.2965 10.2919 32.9645 10.3152 28.7342 12.9911 38.0096 28.6045 44.2766 19.2103 67.3543 50.5482
temp: 298.150 k
press: 1.00000 atm
elementType: 15 8 8 8 8 6 6 6 6 1 1 1 1 1 1 1 1 1 1 1
symmnumber: 1
zpe: 407812.4 jmol-1
zpe.correction: 0.155328 hartree
zpe.thermalcorrener: 0.166957 hartree
zpe.thermalcorrenthalpy: 0.167901 hartree
zpe.thermalcorrgfe: 0.118099 hartree
zpe.sumelectzpe: -800.383898 hartree
zpe.sumelectthermal: -800.372269 hartree
zpe.sumelectthermalent: -800.371325 hartree
zpe.sumelectthermalfe: -800.421126 hartree
dipole: -2.0991 3.1322 0.4117
dipole: 3.7929
quadrupole: -59.0487 -68.3657 -58.3820
quadrupole: 5.7402 -0.4311 -3.4052
quadrupole: 2.8834 -6.4336 3.5501 5.7402 -0.4311 -3.4052
hfenergy: -800.5392256 hartree
pointgroup: C01 [X(C4H11O4P1)]
dipole: -0.4946117 -1.0117555 -0.979025 debye
dipolederiv: 2.2915465 0.2056597 0.0523459 -0.088976 1.9210145 -0.2096397 0.2341905 0.0902643 1.7739648 -1.3745414 -0.4888 -0.1607513 -0.4952758 -0.8243409 -0.1549284 -0.2473511 -0.1627492 -0.5970728 -0.7294128 -0.0922513 0.1776092 -0.0980967 -0.8437856 0.2249842 0.2524223 0.3360374 -0.6934258 -0.8731564 0.2162906 0.1237311 0.3027142 -0.9192071 0.0241143 0.1599531 -0.0351902 -0.4971231 -0.688768 -0.0161414 -0.064093 0.0116869 -0.6102505 0.0035884 -0.0464784 -0.0940999 -0.6510299 0.8388496 0.2439796 0.1149717 0.5122748 0.6268931 0.2002128 -0.1100411 0.0102348 0.2546606 -0.0459377 0.0173393 -0.000913 -0.0065279 0.0386669 -0.0666288 -0.003247 -0.0439166 0.080967 -0.0839222 0.0465287 0.0403293 -0.0346374 -0.1079998 -0.1404016 0.0410555 -0.1240496 -0.0298776 0.0222886 0.0310077 0.0308431 0.0165546 0.0039035 -0.0631259 0.0074668 -0.0667147 0.0185457 -0.008248 0.0028155 -0.0535836 -0.0435488 -0.0016441 0.015184 -0.0223886 0.0711905 -0.1128479 0.0800969 0.0211637 0.0127899 0.0510191 0.0330834 0.0680608 -0.0224472 0.0670975 -0.1296738 -0.0656699 -0.1173494 -0.016812 -0.1089485 -0.0903055 -0.0327555 0.0206655 -0.0166235 0.0769485 0.0945618 0.0218546 -0.056904 0.0420254 0.04124 0.1143306 -0.0359373 0.0422071 -0.0833009 -0.070228 0.1010339 0.0298789 0.0840286 0.0763946 -0.0076055 0.0065695 -0.011422 0.0849226 -0.0032824 -0.1407205 0.016382 -0.1389126 -0.0472213 0.000055 0.0194444 0.0211226 0.0684487 0.0293777 -0.1402308 -0.0120216 -0.115367 -0.0317251 -0.012965 0.0105223 0.0046529 0.0621585 0.1016772 0.0221568 -0.0502384 0.0178778 0.0024002 0.1132116 -0.0105942 0.0702165 -0.1038919 -0.1596633 0.1215824 0.0242803 0.107643 0.0451791 -0.0272413 -0.0033 -0.0168328 0.0774125 0.3497457 -0.0393415 -0.091207 -0.0281159 0.3493599 -0.0280233 -0.1438392 -0.088366 0.197896 0.2946859 -0.0165774 -0.1166374 0.0125821 0.3383448 -0.0204269 -0.1066657 -0.053059 0.2023187 unknown
polarizability: 86.447956|3.3736922|75.9147395|2.9221174|5.4311875|77.7061463 unknown
InChI: InChI=1S/C4H11O4P/c1-3-4(2)8-9(5,6)7/h4-6H,3H2,1-2H3
charge 0 multiplicity 1
20 atoms
P  1.364834 0.662581 0.610949
O  -0.021676 0.458092 -0.363222
O  2.077987 1.946813 -0.264548
O  2.244811 -0.773683 0.195597
O  1.261478 0.921686 2.167601
C  -0.998192 -0.670313 -0.099593
C  -2.394678 -0.031654 -0.056228
C  -0.809069 -1.706561 -1.210696
C  -2.605783 0.912551 1.144106
H  -0.754537 -1.108108 0.890627
H  -2.555205 0.511377 -1.007715
H  -3.135747 -0.855937 -0.029951
H  -1.036845 -1.261693 -2.195439
H  0.228854 -2.079231 -1.221189
H  -1.49085 -2.562259 -1.04968
H  -1.88167 1.745075 1.123814
H  -2.475871 0.377934 2.103472
H  -3.622818 1.343643 1.131307
H  1.78386 1.998843 -1.210696
H  2.953819 -1.011758 0.846681
