program: Gaussian 09
title: 000226412
version: EM64L-G09RevD.01
frameworkgroup: C1[X(C16H20O)]
method: RPBEPBE
basis: SDD
operation: Freq
keyword: #pfreq=noraman
keyword: PBEPBE/SDD
title: #p freq=noraman PBEPBE/SDD
converged: YES YES NO NO
title: Mulliken charges:
elementType: O C C C C C C C C C C C C C C C C H H H H H H H H H H H H H H H H H H H H
charge: -0.245690 0.001361 0.352381 0.257682 0.210636 0.076519 -0.735086 -0.734536 -0.612310 -0.641670 -0.853630 0.157159 0.388219 -0.800703 -0.834671 0.089670 -0.769287 0.229311 0.233904 0.213891 0.234647 0.230922 0.213571 0.291106 0.243380 0.236187 0.236998 0.226583 0.226192 0.233483 0.233457 0.238144 0.229441 0.226883 0.256302 0.227374 0.232179
chargesum: 0.00000
title: Mulliken charges with hydrogens summed into heavy atoms:
elementType: O C C C C C C C C C C C C C C C C
charge: -0.245690 0.001361 0.352381 0.257682 0.210636 0.076519 -0.057980 -0.055396 -0.321204 -0.398290 -0.153862 0.157159 0.388219 -0.107571 -0.140203 0.089670 -0.053431
polarizability: 2.67821656e+02 2.77861663e+00 1.90993430e+02 -2.33733610e-01 9.52439502e-01 1.06689116e+02
1716.lowfreq: -11.8235 -5.0258 -0.0007 -0.0004 0.0008 3.4672 34.7200 50.2463 84.6075
frequency: 34.6768 50.2112 84.6019 95.0882 121.8810 132.1309 141.1751 149.4783 182.4913 212.5744 214.3736 232.7794 240.3863 256.9439 268.2609 270.4168 282.6912 312.2228 323.9969 341.7107 391.0974 398.0083 429.6062 466.7840 501.5538 540.0776 546.4171 562.1396 602.0575 624.1412 639.4750 677.0564 685.5313 710.4848 778.5336 812.8170 875.1330 888.7518 935.6430 941.4139 945.8877 958.3667 985.7660 995.1512 1004.4540 1017.8636 1027.8875 1042.0699 1048.1719 1073.1968 1092.6196 1103.0798 1137.8074 1154.9912 1178.9662 1221.1037 1236.4476 1258.9558 1275.6683 1335.5912 1366.2809 1369.5311 1385.4455 1394.2130 1396.4221 1400.7957 1402.6939 1406.8450 1439.7550 1455.5473 1456.4716 1463.3920 1464.8507 1467.3727 1471.8179 1473.9072 1474.1997 1480.8497 1485.2312 1487.2182 1490.6058 1553.5085 1573.5613 1626.7173 1635.9144 2960.9208 2969.2358 2975.4789 2978.3459 2984.7567 2991.4414 3025.6692 3039.5633 3067.8051 3069.2877 3073.9526 3080.7862 3081.4350 3082.7038 3083.0663 3086.7005 3087.2799 3117.5272 3121.8355 3140.1697
redmass: 3.6244 3.8183 3.0207 3.0791 1.0810 1.0730 3.5474 1.1017 2.2019 2.4963 2.7511 3.3128 1.1765 1.4379 1.5406 1.1755 2.5475 2.6921 3.0344 3.5365 3.7219 3.5108 4.2424 3.3492 4.3206 3.8113 3.4344 3.2922 3.2817 3.4911 3.2684 4.2311 3.8448 5.0719 3.3555 2.3929 3.2973 1.4421 1.4880 1.8770 1.4566 1.8318 1.8589 1.2917 1.4364 1.7386 1.4546 1.6259 1.6168 2.6969 1.9580 1.9479 4.1315 2.3669 4.2300 3.8396 2.7750 1.3620 4.6611 3.7697 1.2529 1.1792 1.5293 1.8689 1.4137 1.6203 1.7258 1.9845 1.1855 1.0606 1.0486 1.0483 1.1922 1.0458 1.8028 1.0484 1.0989 1.0616 1.0500 1.1766 1.2443 6.4051 8.7611 7.4199 6.8043 1.0388 1.0384 1.0343 1.0347 1.0370 1.0360 1.0958 1.0970 1.0974 1.1000 1.0992 1.0984 1.0965 1.1009 1.0975 1.1002 1.0960 1.0999 1.0910 1.0912
irintensity: 4.5620 0.9623 1.1276 0.3206 1.5283 0.0569 2.6660 0.0765 2.0236 0.8702 0.1888 1.3705 0.0224 0.9645 1.3120 0.4707 0.0622 1.0034 2.9298 0.5420 3.3791 0.4475 1.0682 0.5603 3.0060 11.1494 2.4753 11.2319 1.0874 3.0331 8.8530 0.3452 0.1611 0.5672 0.5770 7.6232 2.6443 17.4357 0.1170 5.4608 11.4037 18.5597 16.1163 0.7384 3.7034 1.0781 1.2752 9.2051 0.0724 0.8312 7.8408 23.1848 1.2013 1.8000 1.8702 9.1369 184.5573 0.6582 110.0110 9.6432 39.7316 14.3738 47.3534 45.9864 19.9826 6.1907 14.2425 42.8135 36.5458 3.2534 11.2376 3.5214 21.0418 14.3659 5.4467 3.8643 7.5581 14.4563 28.7533 9.0922 38.2735 159.3512 51.4175 98.8778 3.1760 43.7750 37.8334 24.8462 51.5463 30.0441 12.9677 18.6485 20.7021 15.9108 2.0328 55.1867 19.9346 17.2010 15.6221 20.7808 34.2522 31.7147 16.8689 20.1634 3.0891
temp: 298.150 k
press: 1.00000 atm
elementType: 8 6 6 6 6 6 6 6 6 6 6 6 6 6 6 6 6 1 1 1 1 1 1 1 1 1 1 1 1 1 1 1 1 1 1 1 1
symmnumber: 1
zpe: 817587.6 jmol-1
zpe.correction: 0.311403 hartree
zpe.thermalcorrener: 0.329601 hartree
zpe.thermalcorrenthalpy: 0.330545 hartree
zpe.thermalcorrgfe: 0.266303 hartree
zpe.sumelectzpe: -695.679099 hartree
zpe.sumelectthermal: -695.660901 hartree
zpe.sumelectthermalent: -695.659957 hartree
zpe.sumelectthermalfe: -695.724199 hartree
dipole: -2.4672 3.2070 0.7120
dipole: 4.1083
quadrupole: -93.8021 -102.7959 -104.6276
quadrupole: 12.3476 2.5139 -2.0043
quadrupole: 6.6064 -2.3874 -4.2191 12.3476 2.5139 -2.0043
hfenergy: -695.9905021 hartree
pointgroup: C01 [X(C16H20O1)]
dipole: -0.98251 -1.2547796 -0.2697681 debye
polarizability: 267.1013085|-1.8905916|190.6979108|-11.0098011|4.9049233|107.7049822 unknown
InChI: InChI=1S/C16H20O/c1-9-7-14-10(2)11(3)16(5,6)15(14)8-13(9)12(4)17/h7-8H,1-6H3
charge 0 multiplicity 1
37 atoms
O  3.232307 2.273265 0.092168
C  -1.911403 1.248613 0.048896
C  -0.54014 0.578192 -0.05125
C  -2.857094 0.026178 0.056049
C  -0.706662 -0.835696 -0.096584
C  -2.146028 -1.154852 -0.029178
C  -2.181669 2.167084 -1.179369
C  -2.040342 2.073696 1.363327
C  0.736158 1.131507 -0.099229
C  0.42307 -1.675584 -0.180278
C  -4.347962 0.196304 0.14914
C  1.896784 0.295991 -0.205795
C  1.73611 -1.134089 -0.239151
C  -2.669805 -2.568929 -0.052579
C  2.886188 -2.132396 -0.280948
C  3.199407 1.053056 -0.265465
C  4.483916 0.425019 -0.803474
H  -1.44924 2.993941 -1.209652
H  -2.101245 1.600513 -2.124046
H  -3.192583 2.612074 -1.121677
H  -1.864222 1.437903 2.249021
H  -1.300294 2.893962 1.376508
H  -3.047133 2.523625 1.447629
H  0.907422 2.212553 -0.056317
H  0.299864 -2.765153 -0.193319
H  -4.737597 0.803356 -0.692124
H  -4.635336 0.728535 1.077743
H  -4.881451 -0.768886 0.139307
H  -3.770187 -2.609245 0.00372
H  -2.267106 -3.155377 0.79617
H  -2.359789 -3.091863 -0.978172
H  2.495744 -3.160519 -0.194547
H  3.461634 -2.07734 -1.22227
H  3.599987 -1.980036 0.54862
H  5.216708 1.232497 -0.958097
H  4.314192 -0.10881 -1.755135
H  4.909796 -0.298891 -0.085545
