program: Gaussian 09
title: 000226411
version: EM64L-G09RevD.01
frameworkgroup: C1[X(C15H22)]
method: RPBEPBE
basis: SDD
operation: Freq
keyword: #p
keyword: freq=noraman
keyword: PBEPBE/SDD
title: #p freq=noraman PBEPBE/SDD
converged: YES YES NO NO
title: Mulliken charges:
elementType: C C C C C C C C C C C C C C C H H H H H H H H H H H H H H H H H H H H H H
charge: 0.175576 -0.473759 -0.213948 -0.473821 0.330248 0.324258 -0.742675 -0.744274 -0.602901 -0.738647 -0.432770 0.494391 -0.445140 -0.544346 -0.675854 0.200172 0.205814 0.215497 0.197931 0.212840 0.209232 0.211189 0.223484 0.223212 0.225993 0.210275 0.230465 0.224409 0.213855 0.225605 0.232102 0.230892 0.207351 0.206168 0.221873 0.213861 0.221441
chargesum: 0.00000
title: Mulliken charges with hydrogens summed into heavy atoms:
elementType: C C C C C C C C C C C C C C C
charge: 0.175576 -0.067773 0.001548 -0.063050 0.330248 0.324258 -0.098769 -0.084795 -0.372436 -0.074778 -0.200668 0.494391 -0.214247 -0.130827 -0.018678
polarizability: 1.95051786e+02 4.62999478e-01 1.64351633e+02 4.23669519e+00 3.66799077e+00 1.14011224e+02
1716.lowfreq: -1.3931 -0.0008 -0.0006 -0.0003 9.2082 15.9203 39.3482 56.6077 77.8922
frequency: 39.0159 56.5896 77.8867 111.1558 160.8355 182.0519 206.6176 216.3202 226.9950 244.8827 262.1973 269.5177 304.9753 322.0333 328.3515 366.6346 378.2087 416.0906 437.0033 461.4991 489.3075 514.1447 539.9100 600.4869 641.0003 686.5369 707.4834 767.4784 783.9100 789.0291 838.8406 847.4878 875.2623 897.0011 911.9716 929.2942 943.5191 956.6597 962.2008 980.5521 986.8544 1008.3135 1032.4724 1053.6082 1057.8605 1065.0828 1078.5810 1116.6815 1148.1484 1154.4820 1175.2649 1204.0779 1208.2956 1220.9522 1235.0351 1243.5788 1257.0032 1293.5809 1302.6504 1316.0190 1330.8578 1341.0812 1356.2074 1372.7487 1373.8920 1383.4188 1388.9485 1392.2711 1410.2356 1456.5910 1463.0786 1468.2366 1471.5923 1472.0135 1473.4133 1475.9570 1480.7954 1484.1740 1488.5315 1491.0212 1497.7336 1577.1301 1619.4356 2963.1493 2969.2925 2972.2563 2973.2073 2977.1839 2977.3271 2983.2688 2987.4348 3026.0494 3033.5027 3038.0402 3062.4081 3067.5906 3069.3736 3074.8697 3074.9087 3076.2584 3079.1043 3081.8355 3100.5393 3112.5450 3128.6489
redmass: 2.4091 2.9631 3.0975 3.1813 2.9316 1.6006 1.2874 1.3985 1.3176 1.4945 1.2211 2.1676 2.4345 2.6748 2.6125 2.5649 2.3833 2.9512 2.9076 3.0488 3.0339 3.0553 3.0580 2.9344 3.6570 5.4746 2.4251 3.4547 1.5850 1.6969 1.4046 2.2093 2.7467 2.0317 1.5068 1.5094 1.5627 1.6697 1.4161 2.2363 1.9114 1.3427 1.6401 1.6258 1.7790 1.8276 1.9876 1.7713 2.0715 1.3394 1.9198 2.2683 1.8776 2.0968 1.7601 1.2519 1.8804 1.6977 1.3694 1.5846 1.6276 1.4445 1.4688 1.2119 5.0268 1.2263 1.2020 1.2318 2.7447 1.0653 1.0581 1.0536 1.1187 1.0426 1.0683 1.0681 1.0903 1.0723 1.0881 1.0782 2.2958 7.1638 6.3832 1.0784 1.0354 1.0409 1.0357 1.0368 1.0534 1.0594 1.0651 1.0998 1.1016 1.1025 1.0993 1.0985 1.0995 1.0999 1.0999 1.0994 1.0990 1.1011 1.0864 1.0896 1.0964
irintensity: 0.0368 0.0867 0.4319 0.8834 0.0722 0.1592 0.0227 0.0090 0.0065 0.0057 0.0688 0.0965 0.2645 0.4758 0.2277 0.1132 0.3323 0.5071 0.1991 0.3085 2.1522 4.5927 4.3815 2.1655 2.7751 0.1236 4.5843 0.7382 1.1144 1.7909 30.0858 1.0019 9.2622 3.4023 7.9320 1.0733 2.3970 1.5557 0.0603 4.7385 1.9118 0.1883 22.6080 1.9338 3.0327 12.9270 7.4667 1.9108 5.7198 2.3916 2.9842 3.0440 4.1992 2.8628 2.7379 0.5767 2.3757 7.5983 0.8107 1.1051 1.0253 4.5990 2.0085 15.8972 3.3373 16.5278 8.6985 10.3268 9.8900 0.5863 0.3207 5.2943 5.8950 11.6148 7.6818 10.1255 10.5256 7.7310 3.2928 16.9720 44.1112 3.3926 6.8611 14.1413 27.4304 5.2925 44.9142 62.8009 51.5732 46.1104 52.3578 39.3812 9.1520 57.6259 3.6604 72.9876 68.0301 25.9358 53.9404 40.3492 35.6068 40.8770 16.8855 29.8192 25.5474
temp: 298.150 k
press: 1.00000 atm
elementType: 6 6 6 6 6 6 6 6 6 6 6 6 6 6 6 1 1 1 1 1 1 1 1 1 1 1 1 1 1 1 1 1 1 1 1 1 1
symmnumber: 1
zpe: 861237.3 jmol-1
zpe.correction: 0.328028 hartree
zpe.thermalcorrener: 0.343480 hartree
zpe.thermalcorrenthalpy: 0.344424 hartree
zpe.thermalcorrgfe: 0.286340 hartree
zpe.sumelectzpe: -583.660888 hartree
zpe.sumelectthermal: -583.645436 hartree
zpe.sumelectthermalent: -583.644492 hartree
zpe.sumelectthermalfe: -583.702577 hartree
dipole: -0.2669 0.1984 -0.1281
dipole: 0.3564
quadrupole: -87.5806 -89.1083 -96.0060
quadrupole: 0.1076 1.2416 1.2896
quadrupole: 3.3177 1.7900 -5.1078 0.1076 1.2416 1.2896
hfenergy: -583.9889164 hartree
pointgroup: C01 [X(C15H22)]
dipole: -0.1078633 0.074742 -0.0493699 debye
polarizability: 195.0833573|1.433263|164.4312709|3.1581917|3.6072517|113.9000143 unknown
InChI: InChI=1S/C15H22/c1-5-12-6-7-13-11(2)8-9-15(3,4)14(13)10-12/h6-7,10-11H,5,8-9H2,1-4H3
charge 0 multiplicity 1
37 atoms
C  -1.278289 1.454701 0.093393
C  -2.700401 0.818815 0.112366
C  -1.88831 -1.530807 -0.426256
C  -2.838199 -0.382251 -0.842902
C  -0.183465 0.360836 0.096217
C  -0.46963 -1.009779 -0.174312
C  -1.157167 2.377472 1.339983
C  -1.11164 2.325968 -1.189994
C  1.167666 0.734844 0.329803
C  -2.426956 -2.304916 0.811001
C  0.602112 -1.940554 -0.194077
C  2.23605 -0.190079 0.312928
C  1.93234 -1.549564 0.045057
C  3.673973 0.26387 0.526527
C  4.402325 0.577327 -0.808484
H  -3.439686 1.6026 -0.145245
H  -2.935625 0.492501 1.145086
H  -1.835542 -2.258854 -1.262235
H  -3.883663 -0.74781 -0.847513
H  -2.605676 -0.064735 -1.878379
H  -0.228549 2.975713 1.330597
H  -2.007413 3.085611 1.36479
H  -1.173117 1.785829 2.273543
H  -0.103797 2.777369 -1.233907
H  -1.245934 1.724718 -2.107129
H  -1.856859 3.144465 -1.19839
H  1.401243 1.787281 0.5360
H  -2.528036 -1.641348 1.688842
H  -3.419309 -2.743039 0.59316
H  -1.742895 -3.124894 1.094642
H  0.379262 -2.994836 -0.405843
H  2.738117 -2.294116 0.023666
H  3.691741 1.16684 1.166749
H  4.238733 -0.520709 1.066745
H  4.429983 -0.314192 -1.461262
H  5.443287 0.902842 -0.625624
H  3.881125 1.380081 -1.361141
