program: Gaussian 09
title: 000237896
version: EM64L-G09RevD.01
frameworkgroup: C1[X(C12H23ClO2)]
method: RPBEPBE
basis: SDD
operation: Freq
keyword: #p
keyword: freq=noraman
keyword: PBEPBE/SDD
title: #p freq=noraman PBEPBE/SDD
converged: YES YES NO NO
title: Mulliken charges:
elementType: Cl O O C C C C C C C C C C C C H H H H H H H H H H H H H H H H H H H H H H H
charge: -0.049230 -0.264472 -0.244673 -0.410907 0.013878 -0.377708 -0.379577 -0.382922 0.035947 -0.372592 -0.342523 -0.352977 -0.638163 -0.356701 -0.696436 0.215213 0.223369 0.191189 0.185132 0.231681 0.190437 0.199441 0.197442 0.191376 0.242151 0.190862 0.188711 0.210589 0.226455 0.189030 0.187244 0.278376 0.256392 0.195279 0.194263 0.209389 0.214860 0.210177
chargesum: 0.00000
title: Mulliken charges with hydrogens summed into heavy atoms:
elementType: Cl O O C C C C C C C C C C C C
charge: -0.049230 -0.264472 -0.244673 0.027675 0.205067 0.039105 0.010302 0.005895 0.278098 0.006981 0.094521 0.023297 -0.103396 0.032841 -0.062011
polarizability: 1.79208649e+02 3.37688700e+00 1.41671713e+02 7.65035648e-01 3.15632824e+00 1.14866533e+02
1716.lowfreq: -11.1363 -4.5377 -0.0015 0.0007 0.0011 4.7877 8.0350 20.0340 26.6952
frequency: -8.8501 19.7149 26.4015 42.2754 48.8260 80.6442 88.8985 98.6239 112.2359 139.8035 145.4482 161.8992 175.7030 191.3014 224.2394 226.0012 299.6047 320.5487 374.7041 413.2752 431.7351 482.8334 521.0188 651.5139 667.5321 697.9010 719.9310 725.8004 740.0054 766.1622 803.5764 845.6980 869.6914 886.4191 889.0010 901.5113 944.2116 974.3033 985.2302 991.7572 1001.9439 1009.4655 1019.7272 1047.6369 1067.9931 1080.6909 1081.5913 1101.5746 1108.8524 1122.8961 1159.0366 1164.4692 1188.9088 1205.8033 1215.4739 1224.6037 1252.4236 1256.9624 1258.4918 1268.7228 1279.1229 1282.6755 1287.4186 1293.2572 1295.8102 1298.9926 1322.6372 1329.3944 1346.2482 1353.1292 1355.3840 1360.8742 1388.8685 1392.7923 1428.9213 1450.5783 1461.3967 1461.7064 1466.0760 1471.7439 1476.3883 1478.3514 1478.9856 1485.2954 1488.5645 2913.1576 2950.1206 2951.2695 2953.8192 2960.0181 2966.8511 2968.6596 2971.2621 2984.1634 2985.6518 2992.1274 2999.1785 3004.4611 3005.6766 3020.2257 3033.5766 3042.4282 3053.1053 3067.7020 3069.7308 3070.2170 3072.5231 3141.9772
redmass: 2.7142 4.4015 2.3007 3.6947 3.7374 3.8018 1.6656 3.1612 3.2897 1.8630 2.2627 3.0221 3.4108 3.6791 2.7661 1.2825 4.4073 3.3677 4.0359 2.8605 2.6622 3.0863 2.8586 5.8854 7.2196 4.4722 1.0610 1.0948 1.2823 1.6223 1.4938 2.1185 1.8545 2.0467 1.9061 2.6007 1.3922 5.3293 3.3492 4.2126 2.2019 1.1723 3.9668 3.1872 2.8309 2.3899 2.1312 1.8677 1.8142 2.5357 1.1459 2.0939 1.6950 1.3169 1.2907 1.4204 1.2303 1.2149 1.2714 1.1676 1.0291 1.1804 1.2169 1.0908 1.2315 1.1323 1.3252 1.3002 1.4197 1.6136 1.5378 1.5489 1.2171 1.6584 1.1092 1.0887 1.0732 1.0694 1.0706 1.0783 1.0425 1.0864 1.0811 1.0884 1.0935 1.0842 1.0588 1.0588 1.0593 1.0597 1.0618 1.0606 1.0368 1.0960 1.0672 1.0973 1.0623 1.0990 1.0802 1.1020 1.1020 1.1028 1.0582 1.1007 1.0993 1.1031 1.1028 1.1102
irintensity: 0.8925 0.8130 0.5184 1.3101 1.0866 1.9893 0.3365 2.2400 0.3614 0.7419 0.7662 4.5444 0.3263 0.4670 1.5486 0.2684 1.0515 2.3888 8.4610 7.5949 3.2069 2.1748 5.2853 1.1692 39.1703 7.1706 15.0522 0.3014 2.5851 8.1803 3.5183 38.3983 48.0841 6.7461 12.6781 15.5029 6.3026 57.2385 25.9594 1.8903 28.9785 6.5250 13.1363 1.8221 4.5932 2.9217 0.2324 65.9103 1.9562 6.5358 1.1841 13.4565 2.6772 0.5594 11.6642 0.9366 0.5055 2.1444 0.7728 19.0250 0.5650 4.0160 0.5616 0.6227 1.7641 0.6435 2.4316 2.8994 11.1941 0.9202 3.3873 2.6254 11.1967 37.1969 9.9097 6.4510 0.0178 0.2278 0.1769 0.9699 12.2782 4.1826 2.8131 1.7337 31.6445 77.5827 0.2136 2.1959 0.6313 22.4414 4.0331 187.6266 35.3871 2.0146 31.6821 1.5113 21.5202 3.9806 74.7575 1.3970 28.6296 107.1851 12.5879 85.6400 55.2731 62.5561 47.4988 10.9473
temp: 298.150 k
press: 1.00000 atm
elementType: 17 8 8 6 6 6 6 6 6 6 6 6 6 6 6 1 1 1 1 1 1 1 1 1 1 1 1 1 1 1 1 1 1 1 1 1 1 1
symmnumber: 1
zpe: 869899.0 jmol-1
zpe.correction: 0.331327 hartree
zpe.thermalcorrener: 0.348891 hartree
zpe.thermalcorrenthalpy: 0.349835 hartree
zpe.thermalcorrgfe: 0.282234 hartree
zpe.sumelectzpe: -1080.322620 hartree
zpe.sumelectthermal: -1080.305057 hartree
zpe.sumelectthermalent: -1080.304113 hartree
zpe.sumelectthermalfe: -1080.371713 hartree
dipole: -1.1565 -2.0418 0.6340
dipole: 2.4307
quadrupole: -86.4132 -111.0257 -98.8661
quadrupole: 7.0445 -1.7437 -3.6734
quadrupole: 12.3552 -12.2574 -0.0978 7.0445 -1.7437 -3.6734
hfenergy: -1080.6539475 hartree
pointgroup: C01 [X(C12H23Cl1O2)]
dipole: -0.5103093 -0.7623105 0.2702342 debye
polarizability: 179.373882|1.0926116|141.6308824|2.7486119|1.9087212|114.7421308 unknown
InChI: InChI=1S/C12H23ClO2/c1-2-3-4-5-6-7-8-12-14-10-11(9-13)15-12/h11-12H,2-10H2,1H3
charge 0 multiplicity 1
38 atoms
Cl -4.348302 3.223255 -0.429989
O  -2.76837 0.425084 0.04493
O  -3.460187 -1.755452 -0.39525
C  -1.047221 -1.271436 -0.392926
C  -2.388724 -0.98192 0.257459
C  0.115462 -0.516231 0.290176
C  1.475518 -0.784597 -0.391017
C  2.65057 -0.055735 0.298509
C  -4.241243 0.468731 0.17551
C  4.012285 -0.301915 -0.389574
C  -4.699153 -1.015203 -0.093428
C  5.188701 0.417858 0.307722
C  -4.80528 1.44324 -0.847189
C  6.55045 0.178851 -0.383996
C  7.720213 0.897727 0.322576
H  -0.874336 -2.363953 -0.345787
H  -1.11999 -0.990641 -1.459949
H  -2.393225 -1.200911 1.351713
H  0.176146 -0.814803 1.357847
H  -0.102008 0.569032 0.276984
H  1.676477 -1.876679 -0.40052
H  1.420935 -0.468563 -1.453514
H  2.442689 1.034337 0.319622
H  2.711891 -0.38063 1.358388
H  -4.514463 0.785001 1.201318
H  3.953896 0.031684 -1.446856
H  4.216638 -1.392951 -0.419116
H  -5.199307 -1.434254 0.801099
H  -5.357922 -1.122083 -0.972002
H  4.983582 1.50846 0.342127
H  5.251666 0.080865 1.363781
H  -4.396286 1.24615 -1.849125
H  -5.906322 1.42687 -0.853499
H  6.487639 0.519307 -1.437833
H  6.753178 -0.911149 -0.42153
H  7.822286 0.553197 1.369139
H  8.681753 0.710491 -0.190192
H  7.556665 1.991865 0.345489
