program: Gaussian 09
title: 000226401
version: EM64L-G09RevD.01
frameworkgroup: C1[X(C14H20)]
method: RPBEPBE
basis: SDD
operation: Freq
keyword: #p
keyword: freq=noraman
keyword: PBEPBE/SDD
title: #p freq=noraman PBEPBE/SDD
converged: YES YES NO NO
title: Mulliken charges:
elementType: C C C C C C C C C C C C C C H H H H H H H H H H H H H H H H H H H H
charge: 0.208598 -0.487114 -0.478249 -0.220464 0.311762 0.322529 -0.403651 -0.755825 -0.736974 -0.404164 -0.425993 -0.715549 -0.279168 -0.258694 0.200010 0.208162 0.199032 0.212993 0.214352 0.195989 0.193003 0.222917 0.225523 0.210684 0.225337 0.215069 0.225192 0.231575 0.235209 0.208119 0.241003 0.210832 0.223747 0.224207
chargesum: 0.00000
title: Mulliken charges with hydrogens summed into heavy atoms:
elementType: C C C C C C C C C C C C C C
charge: 0.208598 -0.078942 -0.066223 -0.006111 0.311762 0.322529 -0.014659 -0.096701 -0.071377 -0.172589 -0.190784 -0.055594 -0.055421 -0.034487
polarizability: 1.63584270e+02 2.95831239e+00 1.56559518e+02 -4.31612214e+00 5.51786133e-01 1.08514071e+02
1716.lowfreq: -15.3336 -0.0004 -0.0004 0.0007 5.2481 14.3999 54.3009 80.2982 110.7046
frequency: 54.1161 80.2748 110.6417 150.8115 198.8864 202.4925 220.0024 227.3540 245.3914 279.0215 287.1849 322.2312 362.1396 367.1436 405.0599 430.4352 469.9874 495.2341 518.5600 538.8399 572.4622 634.4374 670.2904 747.0987 765.0780 768.3325 773.8221 824.8659 853.3843 875.5026 883.6526 915.8930 950.4707 956.9704 983.6671 986.6520 994.2937 1013.4465 1033.4438 1040.6852 1046.4973 1064.8369 1085.9921 1115.4005 1134.6206 1142.4159 1173.9791 1178.9114 1191.0532 1203.4523 1221.7260 1242.1562 1262.9865 1304.5762 1307.4473 1324.9159 1334.6321 1342.8045 1355.4286 1373.5290 1383.6172 1387.4874 1391.9642 1434.3319 1456.3440 1466.4480 1469.2286 1473.4302 1474.8364 1478.8861 1481.0468 1485.8000 1487.5275 1489.7572 1582.3519 1610.3398 2964.8428 2966.5556 2971.8462 2974.8616 2980.5559 2982.1116 2991.8659 3013.8590 3029.8864 3044.2145 3065.9612 3069.1013 3070.6213 3077.7699 3078.8371 3082.1995 3104.7086 3117.7705 3134.2234 3155.5032
redmass: 3.0279 3.0187 2.2605 2.2729 1.5210 1.6271 1.4907 1.2492 1.6924 2.8151 2.5508 2.3896 2.1190 2.6649 3.4207 2.8708 3.1011 3.3478 3.0294 3.0614 3.2578 2.8143 4.1276 2.3813 1.2714 2.4064 2.0517 1.9721 2.1284 1.4381 1.8754 1.9705 1.4134 1.6275 1.4063 1.5249 1.9327 1.6975 1.4558 2.4534 1.6831 2.3767 2.0927 1.6708 1.8096 2.4275 1.1165 1.8028 1.9005 1.9879 1.5620 1.7137 1.4050 1.3829 1.5866 1.4963 1.5178 1.4371 1.4859 5.1657 1.2453 1.2037 1.2103 2.2147 1.0664 1.0582 1.2427 1.0666 1.0994 1.0782 1.1523 1.4288 1.1141 1.0695 6.9627 6.1369 1.0783 1.0558 1.0394 1.0359 1.0479 1.0507 1.0634 1.1000 1.1003 1.1011 1.0986 1.0986 1.0994 1.0990 1.0991 1.0998 1.0872 1.0864 1.0928 1.1005
irintensity: 0.0548 0.0264 0.0606 1.0279 0.1631 0.1658 0.1083 0.0547 0.0115 0.1952 0.6385 0.7386 0.3663 0.2779 0.3146 1.8545 0.2555 0.7506 6.8080 4.1030 1.0355 2.7645 2.0829 3.4766 69.8883 3.5958 3.6349 5.9604 0.3761 0.0377 0.4303 0.5694 1.0727 1.0420 0.7091 1.2803 14.1154 8.5141 17.1679 7.8013 2.5489 4.2966 0.7010 0.4944 1.9474 0.2429 0.4909 0.3664 1.3146 4.1359 3.1594 1.0823 1.2815 0.5397 3.1941 0.5789 1.4812 4.7737 1.5390 2.6257 3.0227 18.3804 26.3710 8.7491 0.9794 7.4075 1.5225 2.8092 6.1165 2.5722 15.5704 23.6028 12.4088 25.0869 1.4881 1.6856 14.8637 13.4848 56.8699 37.5726 10.0067 68.1772 58.0378 23.1320 32.6813 60.9813 41.1513 55.0854 39.3514 36.4527 27.2498 52.4129 15.5744 3.1600 35.5546 35.0591
temp: 298.150 k
press: 1.00000 atm
elementType: 6 6 6 6 6 6 6 6 6 6 6 6 6 6 1 1 1 1 1 1 1 1 1 1 1 1 1 1 1 1 1 1 1 1
symmnumber: 1
zpe: 789824.3 jmol-1
zpe.correction: 0.300828 hartree
zpe.thermalcorrener: 0.314545 hartree
zpe.thermalcorrenthalpy: 0.315489 hartree
zpe.thermalcorrgfe: 0.261771 hartree
zpe.sumelectzpe: -544.430791 hartree
zpe.sumelectthermal: -544.417075 hartree
zpe.sumelectthermalent: -544.416130 hartree
zpe.sumelectthermalfe: -544.469848 hartree
dipole: 0.5174 0.4004 -0.0642
dipole: 0.6574
quadrupole: -82.8516 -81.8014 -90.1849
quadrupole: -0.6727 -0.5973 -0.3689
quadrupole: 2.0944 3.1446 -5.2389 -0.6727 -0.5973 -0.3689
hfenergy: -544.7316195 hartree
pointgroup: C01 [X(C14H20)]
dipole: 0.2301051 0.1144151 -0.0291741 debye
polarizability: 164.4256877|1.2820197|155.7401172|-4.2873986|-0.033543|108.4920544 unknown
InChI: InChI=1S/C14H20/c1-4-14(3)10-9-11(2)12-7-5-6-8-13(12)14/h5-8,11H,4,9-10H2,1-3H3
charge 0 multiplicity 1
34 atoms
C  1.32778 -0.638038 -0.362925
C  2.057179 0.728441 -0.192744
C  1.317438 1.897396 -0.873112
C  -0.084116 2.105349 -0.250421
C  -0.201426 -0.486217 -0.187845
C  -0.852144 0.782861 -0.167619
C  1.931915 -1.666971 0.655016
C  1.60243 -1.182168 -1.800243
C  -0.00557 2.790225 1.144105
C  -1.005761 -1.655737 -0.098331
C  -2.267101 0.835306 -0.054709
C  1.618094 -1.416861 2.146339
C  -2.408186 -1.592621 0.019285
C  -3.049413 -0.331901 0.040691
H  3.08085 0.632218 -0.60566
H  2.174125 0.957674 0.88323
H  1.908496 2.828789 -0.775147
H  1.213806 1.696083 -1.95756
H  -0.658973 2.787174 -0.910878
H  3.031522 -1.66764 0.505224
H  1.591442 -2.686669 0.385133
H  1.065487 -2.131965 -1.976397
H  1.271425 -0.465773 -2.573191
H  2.684886 -1.367678 -1.939433
H  0.551835 2.168657 1.867823
H  0.500531 3.771006 1.067019
H  -1.015403 2.955197 1.561037
H  -0.523079 -2.640077 -0.118918
H  -2.758862 1.817105 -0.051393
H  2.00223 -0.440066 2.49347
H  0.530093 -1.437735 2.334515
H  2.08709 -2.196249 2.775206
H  -2.996073 -2.514923 0.089205
H  -4.140044 -0.263295 0.12293
